{"text_format":"1","workbook":"xlsx","n_sheets":7,"sheets":["armamentario","lancio moneta","problema monete","problema dadi","pi.greco","code","viaggio"],"not_rendered":{"charts":1,"images":0,"macros":1,"external_links":0,"defined_names":0,"comments":0,"pivot_tables":0},"unopened":[],"bounds":{"document_bytes":16777216,"sheet_cells":100000,"rows_first":2000,"rows_last":500,"rows_between":2000,"halvings":0,"cell_chars":16384,"cell_head_chars":4096},"cells_cut":0,"cells_raw":0,"read":"whole","date_system":"1900"}

{"sheet":"armamentario","index":0,"n_rows":17,"n_cols":7,"rows_kept":17,"cut":false,"hidden":false,"merged":[]}
["SOMMA","=SOMMA(intervallo) \nrestituisce la somma dei valori nelle celle dell'intervallo specificato",null,1.5,2,3,4]
["esempio","=SOMMA(D1:G1) \nrestituisce 10 perché 1,5+2+3+4=10,5"]
[]
["MIN","=MIN(intervallo) \nrestituisce il minore tra i valori nelle celle dell'intervallo specificato"]
["esempio","=MIN(D1:G1) \nrestituisce 1,5"]
[]
["ASS","=ASS(cella)\nrestituisce il valore assoluto del valorenella cella"]
["esempi","=INT(D1-E1)\ndato che le celle D1 e E1 contengono i valore 1,5 e 2, restituisce 0,5\n=ASS(-2) \nrestituisce 2"]
[]
["SE","=SE(condizione;risultato1;risultato2)\nrestituisce risultato1 se la condizione è vera e risultato2 altrimenti"]
["esempi","=SE(D1>2;1;4) \ndato che la cella D1 contiene il valore 1,5 restituisce 4\n=SE(E1>1;0;3)\ndato che la cella E1 contiene il valore 2 restituisce 0"]
[]
["alternativa a SE","=1*(condizione)\nrestituisce 1 se la condizione è vera e 0 altrimenti"]
["esempi","=1*(D1>=1) \ndato che la cella D1 contiene il valore 1,5 la condizione è vera e la formula restituisce 1\n=1*(D1>2) \ndato che la cella D1 contiene il valore 1,5 la condizione è falsa e la formula restituisce 0"]
[]
["CASUALE","=CASUALE()\nrestituisce un valore casuale uniformemente distribuito nell'intervallo (0, 1)"]
["esempio","=CASUALE() \nogni invocazione della funzione restituisce un valore diverso: 0,84576, 0,423114, 0,278754, …"]

{"sheet":"lancio moneta","index":1,"n_rows":1001,"n_cols":6,"rows_kept":1001,"cut":false,"hidden":false,"merged":[]}
[null,"esiti (parole)",null,"esiti (numeri)"]
[{"$f":"RAND()","v":0.33893211366345688},{"$f":"IF(A2<0.5,\"testa\",\"croce\")","v":"testa"},{"$f":"C1+1","v":1},{"$f":"IF(B2=\"testa\",1,0)","v":1},{"$f":"E1+D2","v":1},{"$f":"E2/C2","v":1}]
[{"$f":"RAND()","v":0.28961289115627709},{"$f":"IF(A3<0.5,\"testa\",\"croce\")","v":"testa"},{"$f":"C2+1","v":2},{"$f":"IF(B3=\"testa\",1,0)","v":1},{"$f":"E2+D3","v":2},{"$f":"E3/C3","v":1}]
[0.26098198951553953,"testa",3,1,3,1]
[0.22459071098823546,"testa",4,1,4,1]
[0.18720359974457246,"testa",5,1,5,1]
[0.85247518125055288,"croce",6,0,5,0.83333333333333337]
[2.5710313289820652E-2,"testa",7,1,6,0.8571428571428571]
[0.53176323036358253,"croce",8,0,6,0.75]
[0.42357346205680901,"testa",9,1,7,0.77777777777777779]
[0.79323049971223081,"croce",10,0,7,0.7]
[0.28906849362111797,"testa",{"$f":"C11+1","v":11},{"$f":"IF(B12=\"testa\",1,0)","v":1},{"$f":"E11+D12","v":8},{"$f":"E12/C12","v":0.72727272727272729}]
[0.88314547023451939,"croce",12,0,8,0.66666666666666663]
[9.930195283356047E-2,"testa",13,1,9,0.69230769230769229]
[0.26369011030984579,"testa",14,1,10,0.7142857142857143]
[0.95750801243016204,"croce",15,0,10,0.66666666666666663]
[0.16887023022258463,"testa",16,1,11,0.6875]
[0.24128860282914855,"testa",17,1,12,0.70588235294117652]
[0.60330663043581811,"croce",18,0,12,0.66666666666666663]
[0.92588149237674267,"croce",19,0,12,0.63157894736842102]
[0.34573585171974064,"testa",20,1,13,0.65]
[0.31981443504685514,"testa",21,1,14,0.66666666666666663]
[0.58419135375022313,"croce",22,0,14,0.63636363636363635]
[0.21057211632969886,"testa",23,1,15,0.65217391304347827]
[0.84016042374457078,"croce",24,0,15,0.625]
[0.99448566058031995,"croce",25,0,15,0.6]
[0.98819361366440073,"croce",26,0,15,0.57692307692307687]
[0.30785231656138401,"testa",27,1,16,0.59259259259259256]
[0.97783960455817232,"croce",28,0,16,0.5714285714285714]
[0.50559686054941666,"croce",29,0,16,0.55172413793103448]
[0.23408436960666779,"testa",30,1,17,0.56666666666666665]
[5.5432332993072597E-2,"testa",31,1,18,0.58064516129032262]
[0.66016903271839777,"croce",32,0,18,0.5625]
[0.21168108990691936,"testa",33,1,19,0.5757575757575758]
[0.24771759398872439,"testa",34,1,20,0.58823529411764708]
[0.6302327217245387,"croce",35,0,20,0.5714285714285714]
[0.98147042713971633,"croce",36,0,20,0.55555555555555558]
[0.50510055764046746,"croce",37,0,20,0.54054054054054057]
[0.50183338916356268,"croce",38,0,20,0.52631578947368418]
[0.31944539384614545,"testa",39,1,21,0.53846153846153844]
[0.88482876216865058,"croce",40,0,21,0.52500000000000002]
[0.5544883600596312,"croce",41,0,21,0.51219512195121952]
[6.5252674721760884E-2,"testa",42,1,22,0.52380952380952384]
[0.94033883335181989,"croce",43,0,22,0.51162790697674421]
[0.37015753669048801,"testa",44,1,23,0.52272727272727271]
[0.58676790572633986,"croce",45,0,23,0.51111111111111107]
[0.5588241237877547,"croce",46,0,23,0.5]
[0.81062377446570821,"croce",47,0,23,0.48936170212765956]
[0.12862990516897277,"testa",48,1,24,0.5]
[0.26622315807858354,"testa",49,1,25,0.51020408163265307]
[0.53328678920696049,"croce",50,0,25,0.5]
[0.36224289626629769,"testa",51,1,26,0.50980392156862742]
[0.75503584372224486,"croce",52,0,26,0.5]
[7.5365514063465366E-2,"testa",53,1,27,0.50943396226415094]
[2.4539395713834899E-2,"testa",54,1,28,0.51851851851851849]
[0.13586925986443221,"testa",55,1,29,0.52727272727272723]
[0.45070570571484436,"testa",56,1,30,0.5357142857142857]
[0.36344124979742143,"testa",57,1,31,0.54385964912280704]
[0.33082888798010923,"testa",58,1,32,0.55172413793103448]
[1.3011756565181831E-2,"testa",59,1,33,0.55932203389830504]
[0.61300770168304031,"croce",60,0,33,0.55000000000000004]
[0.55893853001873772,"croce",61,0,33,0.54098360655737709]
[0.76059714884586416,"croce",62,0,33,0.532258064516129]
[0.78866582066236801,"croce",63,0,33,0.52380952380952384]
[0.42501916816265828,"testa",64,1,34,0.53125]
[0.55305063973966195,"croce",65,0,34,0.52307692307692311]
[{"$f":"RAND()","v":0.11129536824310293},{"$f":"IF(A67<0.5,\"testa\",\"croce\")","v":"testa"},66,1,35,0.53030303030303028]
[0.91067082226751084,"croce",67,0,35,0.52238805970149249]
[0.60385134342611135,"croce",68,0,35,0.51470588235294112]
[0.27569773158892841,"testa",69,1,36,0.52173913043478259]
[0.59077352790381166,"croce",70,0,36,0.51428571428571423]
[0.53990665216986999,"croce",71,0,36,0.50704225352112675]
[0.35096906936163097,"testa",72,1,37,0.51388888888888884]
[0.83624366957553298,"croce",73,0,37,0.50684931506849318]
[0.63457080236555563,"croce",74,0,37,0.5]
[0.56998571291911126,"croce",{"$f":"C75+1","v":75},{"$f":"IF(B76=\"testa\",1,0)","v":0},{"$f":"E75+D76","v":37},{"$f":"E76/C76","v":0.49333333333333335}]
[0.77232221539806023,"croce",76,0,37,0.48684210526315791]
[0.68181557590251518,"croce",77,0,37,0.48051948051948051]
[0.84983743696563585,"croce",78,0,37,0.47435897435897434]
[0.35387227968734303,"testa",79,1,38,0.48101265822784811]
[0.12822297841494656,"testa",80,1,39,0.48749999999999999]
[0.44164232985410623,"testa",81,1,40,0.49382716049382713]
[0.59814721356584899,"croce",82,0,40,0.48780487804878048]
[0.28633499620866709,"testa",83,1,41,0.49397590361445781]
[0.42158676566104114,"testa",84,1,42,0.5]
[0.14387921026019768,"testa",85,1,43,0.50588235294117645]
[0.22189044605978736,"testa",86,1,44,0.51162790697674421]
[0.68730614323065065,"croce",87,0,44,0.50574712643678166]
[7.4845353094842193E-2,"testa",88,1,45,0.51136363636363635]
[0.88528862429170441,"croce",89,0,45,0.5056179775280899]
[0.90273082864165055,"croce",90,0,45,0.5]
[0.10017551713307915,"testa",91,1,46,0.50549450549450547]
[0.1033224301257254,"testa",92,1,47,0.51086956521739135]
[0.83461857086198066,"croce",93,0,47,0.5053763440860215]
[0.2797949213135088,"testa",94,1,48,0.51063829787234039]
[0.79519826505863822,"croce",95,0,48,0.50526315789473686]
[0.876020883501478,"croce",96,0,48,0.5]
[7.9811078879967412E-2,"testa",97,1,49,0.50515463917525771]
[0.70972880362955226,"croce",98,0,49,0.5]
[0.22940563383717893,"testa",99,1,50,0.50505050505050508]
[0.8536553049727631,"croce",100,0,50,0.5]
[0.28379959756309059,"testa",101,1,51,0.50495049504950495]
[0.34541112294295351,"testa",102,1,52,0.50980392156862742]
[0.14537975608392761,"testa",103,1,53,0.5145631067961165]
[0.27368946073830258,"testa",104,1,54,0.51923076923076927]
[0.45022030766293397,"testa",105,1,55,0.52380952380952384]
[0.87207000820567115,"croce",106,0,55,0.51886792452830188]
[0.95839940164480819,"croce",107,0,55,0.51401869158878499]
[0.34670064116533905,"testa",108,1,56,0.51851851851851849]
[0.30127569202702609,"testa",109,1,57,0.52293577981651373]
[0.29445303487950969,"testa",110,1,58,0.52727272727272723]
[0.64015267964165767,"croce",111,0,58,0.52252252252252251]
[0.170029757503666,"testa",112,1,59,0.5267857142857143]
[4.9047818944588206E-2,"testa",113,1,60,0.53097345132743368]
[0.59622553812500956,"croce",114,0,60,0.52631578947368418]
[0.30746640502241429,"testa",115,1,61,0.5304347826086957]
[0.28866415421740277,"testa",116,1,62,0.53448275862068961]
[0.84570030979261412,"croce",117,0,62,0.52991452991452992]
[0.30232603394365876,"testa",118,1,63,0.53389830508474578]
[0.94319052133926473,"croce",119,0,63,0.52941176470588236]
[0.66879011695823642,"croce",120,0,63,0.52500000000000002]
[0.3881071031744352,"testa",121,1,64,0.52892561983471076]
[0.5724804042542424,"croce",122,0,64,0.52459016393442626]
[0.93915299782471218,"croce",123,0,64,0.52032520325203258]
[0.67613618180809798,"croce",124,0,64,0.5161290322580645]
[0.84822992957374854,"croce",125,0,64,0.51200000000000001]
[3.5437638799915905E-2,"testa",126,1,65,0.51587301587301593]
[0.62765918621330807,"croce",127,0,65,0.51181102362204722]
[0.14242077479491289,"testa",128,1,66,0.515625]
[0.61623032477919859,"croce",129,0,66,0.51162790697674421]
[{"$f":"RAND()","v":0.79595371441234486},{"$f":"IF(A131<0.5,\"testa\",\"croce\")","v":"croce"},130,0,66,0.50769230769230766]
[6.5279590863147052E-2,"testa",131,1,67,0.51145038167938928]
[0.91879427601990504,"croce",132,0,67,0.50757575757575757]
[0.90946754233030791,"croce",133,0,67,0.50375939849624063]
[0.80116413148005983,"croce",134,0,67,0.5]
[0.95054428557334825,"croce",135,0,67,0.49629629629629629]
[0.38937572694688805,"testa",136,1,68,0.5]
[0.86106139998875331,"croce",137,0,68,0.49635036496350365]
[0.85179025797693497,"croce",138,0,68,0.49275362318840582]
[5.2750642359712385E-2,"testa",{"$f":"C139+1","v":139},{"$f":"IF(B140=\"testa\",1,0)","v":1},{"$f":"E139+D140","v":69},{"$f":"E140/C140","v":0.49640287769784175}]
[0.37237552355922054,"testa",140,1,70,0.5]
[0.42402754108416429,"testa",141,1,71,0.50354609929078009]
[0.82764353990733674,"croce",142,0,71,0.5]
[0.68677187679839802,"croce",143,0,71,0.49650349650349651]
[0.53688755325860427,"croce",144,0,71,0.49305555555555558]
[0.79201560003756133,"croce",145,0,71,0.48965517241379308]
[0.10166118874800389,"testa",146,1,72,0.49315068493150682]
[0.7635484178894042,"croce",147,0,72,0.48979591836734693]
[4.3215491490911306E-2,"testa",148,1,73,0.49324324324324326]
[0.15993746536132591,"testa",149,1,74,0.49664429530201343]
[0.67492153886690121,"croce",150,0,74,0.49333333333333335]
[0.92693205634757214,"croce",151,0,74,0.49006622516556292]
[0.94977752297733353,"croce",152,0,74,0.48684210526315791]
[0.16139315409560817,"testa",153,1,75,0.49019607843137253]
[3.637109896695323E-2,"testa",154,1,76,0.4935064935064935]
[0.3710074810036782,"testa",155,1,77,0.49677419354838709]
[0.41548243782849603,"testa",156,1,78,0.5]
[0.52857390835388463,"croce",157,0,78,0.49681528662420382]
[0.42649599637436308,"testa",158,1,79,0.5]
[4.4990312893616657E-2,"testa",159,1,80,0.50314465408805031]
[0.57455098228212587,"croce",160,0,80,0.5]
[0.91048052924927647,"croce",161,0,80,0.49689440993788819]
[0.83918623004532755,"croce",162,0,80,0.49382716049382713]
[0.77877996335277022,"croce",163,0,80,0.49079754601226994]
[0.19680389338472626,"testa",164,1,81,0.49390243902439024]
[0.42621255045575168,"testa",165,1,82,0.49696969696969695]
[0.43859668214670489,"testa",166,1,83,0.5]
[0.35234153758709141,"testa",167,1,84,0.50299401197604787]
[0.17750266504375478,"testa",168,1,85,0.50595238095238093]
[0.16481338202614715,"testa",169,1,86,0.50887573964497046]
[0.36537112089934032,"testa",170,1,87,0.5117647058823529]
[0.15224094739690552,"testa",171,1,88,0.51461988304093564]
[0.94537182320177671,"croce",172,0,88,0.51162790697674421]
[0.39358352123840201,"testa",173,1,89,0.51445086705202314]
[0.42933295453835696,"testa",174,1,90,0.51724137931034486]
[0.32998925401981838,"testa",175,1,91,0.52]
[0.63778908908393495,"croce",176,0,91,0.51704545454545459]
[0.95645890682244883,"croce",177,0,91,0.51412429378531077]
[0.3163080870417222,"testa",178,1,92,0.5168539325842697]
[0.46598470685050175,"testa",179,1,93,0.51955307262569828]
[0.53341866892634271,"croce",180,0,93,0.51666666666666672]
[0.93386728526252138,"croce",181,0,93,0.51381215469613262]
[0.35203842494610948,"testa",182,1,94,0.51648351648351654]
[0.7718746498660376,"croce",183,0,94,0.51366120218579236]
[0.80300105254630116,"croce",184,0,94,0.51086956521739135]
[0.75063281432671414,"croce",185,0,94,0.50810810810810814]
[0.28193112968438527,"testa",186,1,95,0.510752688172043]
[0.73923057542098125,"croce",187,0,95,0.50802139037433158]
[0.69426528176828917,"croce",188,0,95,0.50531914893617025]
[0.2686165908117244,"testa",189,1,96,0.50793650793650791]
[0.35069202498923557,"testa",190,1,97,0.51052631578947372]
[0.92039468465289531,"croce",191,0,97,0.50785340314136129]
[0.17022213330103986,"testa",192,1,98,0.51041666666666663]
[0.70582593319631082,"croce",193,0,98,0.50777202072538863]
[{"$f":"RAND()","v":0.68317621029953046},{"$f":"IF(A195<0.5,\"testa\",\"croce\")","v":"croce"},194,0,98,0.50515463917525771]
[0.51142300990732981,"croce",195,0,98,0.50256410256410255]
[0.47733853287872918,"testa",196,1,99,0.50510204081632648]
[0.29339585669742452,"testa",197,1,100,0.50761421319796951]
[0.50882639186189205,"croce",198,0,100,0.50505050505050508]
[0.72961775309798171,"croce",199,0,100,0.50251256281407031]
[0.71578933963824054,"croce",200,0,100,0.5]
[9.3605445223092443E-2,"testa",201,1,101,0.50248756218905477]
[0.34168899068172742,"testa",202,1,102,0.50495049504950495]
[0.66654620436459233,"croce",{"$f":"C203+1","v":203},{"$f":"IF(B204=\"testa\",1,0)","v":0},{"$f":"E203+D204","v":102},{"$f":"E204/C204","v":0.50246305418719217}]
[8.9764256040348878E-2,"testa",204,1,103,0.50490196078431371]
[0.40861429491076584,"testa",205,1,104,0.50731707317073171]
[0.71091388871568406,"croce",206,0,104,0.50485436893203883]
[0.97941769558062108,"croce",207,0,104,0.50241545893719808]
[0.32086289073877861,"testa",208,1,105,0.50480769230769229]
[0.4339843953059932,"testa",209,1,106,0.50717703349282295]
[0.8141523732742828,"croce",210,0,106,0.50476190476190474]
[0.30550506536284572,"testa",211,1,107,0.50710900473933651]
[0.20492621522075261,"testa",212,1,108,0.50943396226415094]
[0.92788955090028635,"croce",213,0,108,0.50704225352112675]
[0.74037117761602145,"croce",214,0,108,0.50467289719626163]
[0.16073649303469983,"testa",215,1,109,0.50697674418604655]
[0.26395336456397744,"testa",216,1,110,0.5092592592592593]
[0.54921321600880213,"croce",217,0,110,0.50691244239631339]
[0.15669386855858758,"testa",218,1,111,0.50917431192660545]
[0.5096071904452607,"croce",219,0,111,0.50684931506849318]
[0.1920314419851884,"testa",220,1,112,0.50909090909090904]
[0.59598082817890619,"croce",221,0,112,0.50678733031674206]
[0.82638496993758137,"croce",222,0,112,0.50450450450450446]
[0.97073383149250503,"croce",223,0,112,0.50224215246636772]
[0.37035951851071525,"testa",224,1,113,0.5044642857142857]
[0.46588401236026289,"testa",225,1,114,0.50666666666666671]
[0.24391049089287731,"testa",226,1,115,0.50884955752212391]
[0.76419374791160721,"croce",227,0,115,0.50660792951541855]
[0.25594954151978888,"testa",228,1,116,0.50877192982456143]
[0.79476239778275293,"croce",229,0,116,0.50655021834061131]
[5.3001040290203583E-2,"testa",230,1,117,0.50869565217391299]
[6.4425736827843472E-2,"testa",231,1,118,0.51082251082251084]
[0.75533241174473476,"croce",232,0,118,0.50862068965517238]
[0.17437385142472839,"testa",233,1,119,0.51072961373390557]
[0.25890975327099197,"testa",234,1,120,0.51282051282051277]
[0.26705402097903974,"testa",235,1,121,0.51489361702127656]
[0.84991427265439468,"croce",236,0,121,0.51271186440677963]
[0.70587646224603984,"croce",237,0,121,0.51054852320675104]
[0.45954105089815667,"testa",238,1,122,0.51260504201680668]
[0.91591753537042742,"croce",239,0,122,0.5104602510460251]
[0.84359975334099657,"croce",240,0,122,0.5083333333333333]
[0.62705700590743352,"croce",241,0,122,0.50622406639004147]
[1.3668354462397225E-3,"testa",242,1,123,0.50826446280991733]
[0.70192895822848012,"croce",243,0,123,0.50617283950617287]
[0.98423074512033959,"croce",244,0,123,0.50409836065573765]
[0.90350499693228958,"croce",245,0,123,0.50204081632653064]
[0.91241097567307006,"croce",246,0,123,0.5]
[0.707745068202288,"croce",247,0,123,0.49797570850202427]
[0.3982983500938776,"testa",248,1,124,0.5]
[0.53111038604928684,"croce",249,0,124,0.49799196787148592]
[0.60542990058155555,"croce",250,0,124,0.496]
[0.69725681785882154,"croce",251,0,124,0.49402390438247012]
[0.70638568982319938,"croce",252,0,124,0.49206349206349204]
[0.96209656243583885,"croce",253,0,124,0.49011857707509882]
[0.17778222101764762,"testa",254,1,125,0.49212598425196852]
[0.29555653773538637,"testa",255,1,126,0.49411764705882355]
[0.59744567515336022,"croce",256,0,126,0.4921875]
[0.58581982430131141,"croce",257,0,126,0.49027237354085601]
[{"$f":"RAND()","v":8.8775964708137645E-3},{"$f":"IF(A259<0.5,\"testa\",\"croce\")","v":"testa"},258,1,127,0.49224806201550386]
[8.8269042965729017E-2,"testa",259,1,128,0.49420849420849422]
[0.48273226615247322,"testa",260,1,129,0.49615384615384617]
[0.90225361732025922,"croce",261,0,129,0.4942528735632184]
[0.33058508852300472,"testa",262,1,130,0.49618320610687022]
[0.43679760250997324,"testa",263,1,131,0.49809885931558934]
[0.27330572309473011,"testa",264,1,132,0.5]
[7.1926500524565173E-2,"testa",265,1,133,0.50188679245283019]
[0.48354740326561474,"testa",266,1,134,0.50375939849624063]
[0.44624841737353405,"testa",{"$f":"C267+1","v":267},{"$f":"IF(B268=\"testa\",1,0)","v":1},{"$f":"E267+D268","v":135},{"$f":"E268/C268","v":0.5056179775280899}]
[0.27009866208624389,"testa",268,1,136,0.5074626865671642]
[0.84189435681038582,"croce",269,0,136,0.50557620817843862]
[0.36739207927948347,"testa",270,1,137,0.50740740740740742]
[0.92008716742005281,"croce",271,0,137,0.50553505535055354]
[1.8810173634944527E-2,"testa",272,1,138,0.50735294117647056]
[0.15424516376152309,"testa",273,1,139,0.50915750915750912]
[0.86620900614944107,"croce",274,0,139,0.50729927007299269]
[0.35493280071381961,"testa",275,1,140,0.50909090909090904]
[0.42029827855144042,"testa",276,1,141,0.51086956521739135]
[0.25972273474942309,"testa",277,1,142,0.5126353790613718]
[8.1318071153594351E-2,"testa",278,1,143,0.51438848920863312]
[0.66071043524545137,"croce",279,0,143,0.51254480286738346]
[0.23425568136200048,"testa",280,1,144,0.51428571428571423]
[0.67429978822213998,"croce",281,0,144,0.51245551601423489]
[4.3158834722146322E-2,"testa",282,1,145,0.51418439716312059]
[0.9107485675950816,"croce",283,0,145,0.51236749116607772]
[0.97085960476678723,"croce",284,0,145,0.51056338028169013]
[0.24408251632755917,"testa",285,1,146,0.512280701754386]
[5.8890038889038987E-2,"testa",286,1,147,0.51398601398601396]
[0.81883019202453966,"croce",287,0,147,0.51219512195121952]
[0.46130763283600484,"testa",288,1,148,0.51388888888888884]
[0.55636370881418529,"croce",289,0,148,0.51211072664359858]
[0.67497120770507779,"croce",290,0,148,0.51034482758620692]
[0.37666218025520459,"testa",291,1,149,0.51202749140893467]
[0.43153021675930969,"testa",292,1,150,0.51369863013698636]
[2.7513550665680175E-2,"testa",293,1,151,0.51535836177474403]
[0.75899191274686983,"croce",294,0,151,0.51360544217687076]
[0.97679200616215411,"croce",295,0,151,0.51186440677966105]
[0.41026141544843908,"testa",296,1,152,0.51351351351351349]
[0.64677862954970811,"croce",297,0,152,0.51178451178451179]
[0.21875496018806873,"testa",298,1,153,0.51342281879194629]
[0.91446829041673483,"croce",299,0,153,0.51170568561872909]
[0.99272681605190649,"croce",300,0,153,0.51]
[0.53556076250524731,"croce",301,0,153,0.50830564784053156]
[0.29209352991504878,"testa",302,1,154,0.50993377483443714]
[0.14144647391028387,"testa",303,1,155,0.51155115511551152]
[0.8413389825791816,"croce",304,0,155,0.50986842105263153]
[0.44436321143553437,"testa",305,1,156,0.51147540983606554]
[0.49318570822067598,"testa",306,1,157,0.51307189542483655]
[0.82761139467954681,"croce",307,0,157,0.51140065146579805]
[0.18405279306940481,"testa",308,1,158,0.51298701298701299]
[0.57233762121174603,"croce",309,0,158,0.51132686084142398]
[0.6201077339392137,"croce",310,0,158,0.50967741935483868]
[0.18879294464898744,"testa",311,1,159,0.5112540192926045]
[0.35496259907100525,"testa",312,1,160,0.51282051282051277]
[0.58380032120939906,"croce",313,0,160,0.51118210862619806]
[0.36714089870771505,"testa",314,1,161,0.51273885350318471]
[0.88531392684383281,"croce",315,0,161,0.51111111111111107]
[0.85036386360799021,"croce",316,0,161,0.509493670886076]
[0.35947558722941886,"testa",317,1,162,0.51104100946372244]
[0.36421129491106752,"testa",318,1,163,0.51257861635220126]
[0.27629878320229095,"testa",319,1,164,0.51410658307210033]
[0.82887786069097791,"croce",320,0,164,0.51249999999999996]
[0.73908503506336432,"croce",321,0,164,0.5109034267912772]
[{"$f":"RAND()","v":0.89176293273175011},{"$f":"IF(A323<0.5,\"testa\",\"croce\")","v":"croce"},322,0,164,0.50931677018633537]
[0.49633276658917347,"testa",323,1,165,0.51083591331269351]
[0.20512372916136257,"testa",324,1,166,0.51234567901234573]
[0.69426843091272361,"croce",325,0,166,0.51076923076923075]
[0.24814727385378454,"testa",326,1,167,0.51226993865030679]
[9.8545827306410705E-2,"testa",327,1,168,0.51376146788990829]
[0.40575520368027096,"testa",328,1,169,0.5152439024390244]
[0.73841195093894907,"croce",329,0,169,0.51367781155015202]
[0.11943647575712524,"testa",330,1,170,0.51515151515151514]
[0.32496390974881173,"testa",{"$f":"C331+1","v":331},{"$f":"IF(B332=\"testa\",1,0)","v":1},{"$f":"E331+D332","v":171},{"$f":"E332/C332","v":0.5166163141993958}]
[0.29100365930829075,"testa",332,1,172,0.51807228915662651]
[0.69835058256199778,"croce",333,0,172,0.51651651651651653]
[0.40783825511189609,"testa",334,1,173,0.51796407185628746]
[0.74352022371262316,"croce",335,0,173,0.5164179104477612]
[0.60752216675748361,"croce",336,0,173,0.51488095238095233]
[0.41667270140591295,"testa",337,1,174,0.51632047477744802]
[0.85633690076761215,"croce",338,0,174,0.51479289940828399]
[4.3679702474224147E-2,"testa",339,1,175,0.51622418879056042]
[0.85782957996316533,"croce",340,0,175,0.51470588235294112]
[0.35279020327468136,"testa",341,1,176,0.5161290322580645]
[0.20520011170757335,"testa",342,1,177,0.51754385964912286]
[7.8129419562816382E-2,"testa",343,1,178,0.51895043731778423]
[2.2819636567688706E-2,"testa",344,1,179,0.52034883720930236]
[0.13245348161578863,"testa",345,1,180,0.52173913043478259]
[0.40850287430785526,"testa",346,1,181,0.52312138728323698]
[0.599229830934769,"croce",347,0,181,0.52161383285302598]
[0.73098644684523695,"croce",348,0,181,0.52011494252873558]
[0.22845753268797053,"testa",349,1,182,0.52148997134670483]
[0.97983062579051117,"croce",350,0,182,0.52]
[0.47293858103844866,"testa",351,1,183,0.5213675213675214]
[0.74217182211725241,"croce",352,0,183,0.51988636363636365]
[0.81152836648612214,"croce",353,0,183,0.5184135977337111]
[8.0098682298088364E-2,"testa",354,1,184,0.51977401129943501]
[0.97049529570591753,"croce",355,0,184,0.51830985915492955]
[0.36254277086509312,"testa",356,1,185,0.5196629213483146]
[0.88370337881053473,"croce",357,0,185,0.51820728291316531]
[0.30607823672623269,"testa",358,1,186,0.51955307262569828]
[0.2120399696278632,"testa",359,1,187,0.52089136490250698]
[0.23078021070458521,"testa",360,1,188,0.52222222222222225]
[0.76300044771802433,"croce",361,0,188,0.52077562326869808]
[0.51803293505975834,"croce",362,0,188,0.51933701657458564]
[0.28731589256708268,"testa",363,1,189,0.52066115702479343]
[0.62411209685353985,"croce",364,0,189,0.51923076923076927]
[0.20426222463975729,"testa",365,1,190,0.52054794520547942]
[0.73177581334702524,"croce",366,0,190,0.51912568306010931]
[0.42977898234566692,"testa",367,1,191,0.52043596730245234]
[0.46626539345042251,"testa",368,1,192,0.52173913043478259]
[0.47358658570768886,"testa",369,1,193,0.52303523035230348]
[4.507321416087795E-2,"testa",370,1,194,0.5243243243243243]
[0.94132424496757816,"croce",371,0,194,0.52291105121293802]
[0.23436670503085522,"testa",372,1,195,0.52419354838709675]
[0.52138581388093119,"croce",373,0,195,0.52278820375335122]
[0.19934728986108852,"testa",374,1,196,0.52406417112299464]
[7.7110261008148218E-2,"testa",375,1,197,0.52533333333333332]
[0.29703462782972767,"testa",376,1,198,0.52659574468085102]
[0.14743617620320626,"testa",377,1,199,0.52785145888594165]
[0.66171457195476069,"croce",378,0,199,0.52645502645502651]
[0.814635120095349,"croce",379,0,199,0.52506596306068598]
[0.73745549463714444,"croce",380,0,199,0.52368421052631575]
[0.39583585302789981,"testa",381,1,200,0.52493438320209973]
[0.46494878006288276,"testa",382,1,201,0.52617801047120416]
[0.3442576382600665,"testa",383,1,202,0.52741514360313313]
[0.38162039094557099,"testa",384,1,203,0.52864583333333337]
[0.91046186085939695,"croce",385,0,203,0.52727272727272723]
[{"$f":"RAND()","v":0.17033672542442491},{"$f":"IF(A387<0.5,\"testa\",\"croce\")","v":"testa"},386,1,204,0.52849740932642486]
[0.82210541991822905,"croce",387,0,204,0.52713178294573648]
[0.41761585001816137,"testa",388,1,205,0.52835051546391754]
[0.53014384925673941,"croce",389,0,205,0.52699228791773778]
[0.10262604299259659,"testa",390,1,206,0.52820512820512822]
[0.6953602303882781,"croce",391,0,206,0.52685421994884907]
[0.69554354481231007,"croce",392,0,206,0.52551020408163263]
[0.11857829290839406,"testa",393,1,207,0.52671755725190839]
[0.14487124900740089,"testa",394,1,208,0.52791878172588835]
[0.10924538789318528,"testa",{"$f":"C395+1","v":395},{"$f":"IF(B396=\"testa\",1,0)","v":1},{"$f":"E395+D396","v":209},{"$f":"E396/C396","v":0.52911392405063296}]
[0.31091211192203672,"testa",396,1,210,0.53030303030303028]
[1.8806191386611659E-2,"testa",397,1,211,0.53148614609571787]
[0.91104597910587803,"croce",398,0,211,0.53015075376884424]
[0.51401900408510426,"croce",399,0,211,0.52882205513784464]
[0.98622996162488241,"croce",400,0,211,0.52749999999999997]
[0.24850668181621338,"testa",401,1,212,0.52867830423940154]
[0.46401249367444863,"testa",402,1,213,0.52985074626865669]
[0.87044325726008265,"croce",403,0,213,0.52853598014888337]
[0.84752182029760714,"croce",404,0,213,0.52722772277227725]
[0.82182030557788632,"croce",405,0,213,0.52592592592592591]
[2.0606778631717115E-2,"testa",406,1,214,0.52709359605911332]
[0.9161117197140034,"croce",407,0,214,0.52579852579852582]
[0.21977342017415702,"testa",408,1,215,0.52696078431372551]
[0.49565237048057909,"testa",409,1,216,0.52811735941320292]
[7.0989942830120056E-2,"testa",410,1,217,0.52926829268292686]
[0.23523672453429856,"testa",411,1,218,0.53041362530413627]
[0.87005424822779887,"croce",412,0,218,0.529126213592233]
[0.20576931066145809,"testa",413,1,219,0.53026634382566584]
[0.72019403343530719,"croce",414,0,219,0.52898550724637683]
[0.9677026883057146,"croce",415,0,219,0.52771084337349394]
[9.0851106047788899E-2,"testa",416,1,220,0.52884615384615385]
[0.15441577712877552,"testa",417,1,221,0.52997601918465231]
[0.39561864298554461,"testa",418,1,222,0.53110047846889952]
[9.169235521324981E-2,"testa",419,1,223,0.53221957040572787]
[0.64108138506938495,"croce",420,0,223,0.53095238095238095]
[0.9200517049363478,"croce",421,0,223,0.52969121140142517]
[0.79980808823623228,"croce",422,0,223,0.52843601895734593]
[0.67732477801136526,"croce",423,0,223,0.5271867612293144]
[0.91373489528501495,"croce",424,0,223,0.52594339622641506]
[0.96033660466158244,"croce",425,0,223,0.52470588235294113]
[0.45402155859528293,"testa",426,1,224,0.5258215962441315]
[3.0230793806053535E-2,"testa",427,1,225,0.52693208430913352]
[0.69665730892001532,"croce",428,0,225,0.52570093457943923]
[0.71339152353080415,"croce",429,0,225,0.52447552447552448]
[0.9185274508055955,"croce",430,0,225,0.52325581395348841]
[0.62174624698461534,"croce",431,0,225,0.52204176334106733]
[0.87755449885476677,"croce",432,0,225,0.52083333333333337]
[0.98931354689353834,"croce",433,0,225,0.51963048498845266]
[0.80808322509652375,"croce",434,0,225,0.51843317972350234]
[0.35301074225946938,"testa",435,1,226,0.51954022988505744]
[0.782759037645398,"croce",436,0,226,0.51834862385321101]
[8.8146849549111339E-2,"testa",437,1,227,0.5194508009153318]
[0.7653138206717196,"croce",438,0,227,0.5182648401826484]
[0.14824252586256381,"testa",439,1,228,0.51936218678815493]
[0.54732801990709345,"croce",440,0,228,0.51818181818181819]
[0.85902174184297153,"croce",441,0,228,0.51700680272108845]
[0.25209371465976982,"testa",442,1,229,0.51809954751131226]
[0.18928840644004852,"testa",443,1,230,0.5191873589164786]
[0.3134409204005193,"testa",444,1,231,0.52027027027027029]
[0.82524584746189056,"croce",445,0,231,0.51910112359550564]
[0.33609861006603425,"testa",446,1,232,0.52017937219730936]
[0.11365418700414631,"testa",447,1,233,0.52125279642058164]
[0.24410222246927504,"testa",448,1,234,0.5223214285714286]
[0.84729218206626433,"croce",449,0,234,0.52115812917594651]
[{"$f":"RAND()","v":0.91984111213173159},{"$f":"IF(A451<0.5,\"testa\",\"croce\")","v":"croce"},450,0,234,0.52]
[0.26744140925537119,"testa",451,1,235,0.52106430155210648]
[0.40168745812357576,"testa",452,1,236,0.52212389380530977]
[0.33354859201677056,"testa",453,1,237,0.52317880794701987]
[0.11297704623688976,"testa",454,1,238,0.52422907488986781]
[6.2561055373605567E-3,"testa",455,1,239,0.5252747252747253]
[0.48469129474908601,"testa",456,1,240,0.52631578947368418]
[2.9504762014115116E-2,"testa",457,1,241,0.52735229759299784]
[0.33041562681040293,"testa",458,1,242,0.52838427947598254]
[0.89009079744246966,"croce",{"$f":"C459+1","v":459},{"$f":"IF(B460=\"testa\",1,0)","v":0},{"$f":"E459+D460","v":242},{"$f":"E460/C460","v":0.52723311546840956}]
[0.52185340455214202,"croce",460,0,242,0.52608695652173909]
[0.19977180352342994,"testa",461,1,243,0.52711496746203901]
[0.19405824383835335,"testa",462,1,244,0.52813852813852813]
[0.75296582037296489,"croce",463,0,244,0.52699784017278617]
[0.24292233056463997,"testa",464,1,245,0.52801724137931039]
[0.88961367008422265,"croce",465,0,245,0.5268817204301075]
[0.2869635864132426,"testa",466,1,246,0.52789699570815452]
[0.55151798697299248,"croce",467,0,246,0.52676659528907921]
[0.97638349410908443,"croce",468,0,246,0.52564102564102566]
[0.65310269722739245,"croce",469,0,246,0.52452025586353945]
[9.5083304922704004E-2,"testa",470,1,247,0.52553191489361706]
[0.89954449443152695,"croce",471,0,247,0.52441613588110403]
[0.18402093309475198,"testa",472,1,248,0.52542372881355937]
[0.87093346165237917,"croce",473,0,248,0.52431289640591972]
[0.17223039952697416,"testa",474,1,249,0.52531645569620256]
[0.86756893838835691,"croce",475,0,249,0.52421052631578946]
[0.47119952378737828,"testa",476,1,250,0.52521008403361347]
[9.3953701766913533E-2,"testa",477,1,251,0.52620545073375258]
[0.45717346374372259,"testa",478,1,252,0.52719665271966532]
[0.93914837974858589,"croce",479,0,252,0.52609603340292277]
[8.5956499975967549E-2,"testa",480,1,253,0.52708333333333335]
[0.32265983840103629,"testa",481,1,254,0.5280665280665281]
[0.95312386313030084,"croce",482,0,254,0.52697095435684649]
[0.91459903868939152,"croce",483,0,254,0.52587991718426497]
[2.8646020019688634E-2,"testa",484,1,255,0.52685950413223137]
[0.52968745945518214,"croce",485,0,255,0.52577319587628868]
[0.37591974864058197,"testa",486,1,256,0.52674897119341568]
[0.92097334222192906,"croce",487,0,256,0.52566735112936347]
[0.4258133610594016,"testa",488,1,257,0.52663934426229508]
[0.1035731879932813,"testa",489,1,258,0.52760736196319014]
[0.22395670697837977,"testa",490,1,259,0.52857142857142858]
[0.29882331613723434,"testa",491,1,260,0.52953156822810588]
[0.74939645319296255,"croce",492,0,260,0.52845528455284552]
[0.31432860027441412,"testa",493,1,261,0.52941176470588236]
[0.51094975448657676,"croce",494,0,261,0.52834008097165996]
[0.58533562512961401,"croce",495,0,261,0.52727272727272723]
[0.17995124710039934,"testa",496,1,262,0.52822580645161288]
[5.6839869682188349E-2,"testa",497,1,263,0.52917505030181089]
[0.16381213992982169,"testa",498,1,264,0.53012048192771088]
[0.63009769924656978,"croce",499,0,264,0.5290581162324649]
[1.1541052667937923E-2,"testa",500,1,265,0.53]
[0.46419048560563503,"testa",501,1,266,0.53093812375249505]
[1.4428495294381949E-2,"testa",502,1,267,0.53187250996015933]
[0.6079444112143626,"croce",503,0,267,0.53081510934393639]
[0.14968386288178814,"testa",504,1,268,0.53174603174603174]
[0.49751898803900507,"testa",505,1,269,0.5326732673267327]
[0.31757436825725993,"testa",506,1,270,0.53359683794466406]
[0.95321744397951735,"croce",507,0,270,0.53254437869822491]
[0.97768536374509574,"croce",508,0,270,0.53149606299212604]
[0.66041985610740506,"croce",509,0,270,0.53045186640471509]
[0.73252461377453582,"croce",510,0,270,0.52941176470588236]
[0.55596610244576372,"croce",511,0,270,0.52837573385518588]
[0.92133334414925794,"croce",512,0,270,0.52734375]
[0.16940532921577689,"testa",513,1,271,0.52826510721247566]
[{"$f":"RAND()","v":0.54874707975047543},{"$f":"IF(A515<0.5,\"testa\",\"croce\")","v":"croce"},514,0,271,0.52723735408560313]
[0.13501384280870909,"testa",515,1,272,0.5281553398058253]
[0.38481751861633506,"testa",516,1,273,0.52906976744186052]
[0.82720801338367822,"croce",517,0,273,0.52804642166344296]
[0.98935185153032812,"croce",518,0,273,0.52702702702702697]
[0.43445576198563951,"testa",519,1,274,0.52793834296724473]
[0.35493785144287848,"testa",520,1,275,0.52884615384615385]
[0.82855262851721645,"croce",521,0,275,0.52783109404990403]
[0.36660516628815232,"testa",522,1,276,0.52873563218390807]
[0.72122093664059406,"croce",{"$f":"C523+1","v":523},{"$f":"IF(B524=\"testa\",1,0)","v":0},{"$f":"E523+D524","v":276},{"$f":"E524/C524","v":0.52772466539196938}]
[0.11110347317343272,"testa",524,1,277,0.52862595419847325]
[0.30425378650524726,"testa",525,1,278,0.52952380952380951]
[7.1093026445201213E-2,"testa",526,1,279,0.53041825095057038]
[0.87718579521476303,"croce",527,0,279,0.52941176470588236]
[0.62207943756089334,"croce",528,0,279,0.52840909090909094]
[0.90175099112854284,"croce",529,0,279,0.52741020793950855]
[0.33139616012935003,"testa",530,1,280,0.52830188679245282]
[1.9395101762629818E-2,"testa",531,1,281,0.52919020715630882]
[0.29036696884541491,"testa",532,1,282,0.53007518796992481]
[0.87941299416073304,"croce",533,0,282,0.52908067542213888]
[0.20163118291826676,"testa",534,1,283,0.52996254681647936]
[4.8854395549132623E-2,"testa",535,1,284,0.53084112149532714]
[0.90996730935994274,"croce",536,0,284,0.52985074626865669]
[0.10913692786677576,"testa",537,1,285,0.53072625698324027]
[0.37017141816900279,"testa",538,1,286,0.53159851301115246]
[0.51512477895271847,"croce",539,0,286,0.53061224489795922]
[0.65411956894311818,"croce",540,0,286,0.52962962962962967]
[0.4158239314633615,"testa",541,1,287,0.53049907578558231]
[0.95044529429970337,"croce",542,0,287,0.52952029520295207]
[0.92314509582348758,"croce",543,0,287,0.52854511970534068]
[0.26412245961373382,"testa",544,1,288,0.52941176470588236]
[0.8629381656625611,"croce",545,0,288,0.52844036697247709]
[0.43260569942954341,"testa",546,1,289,0.52930402930402931]
[0.3126750218824218,"testa",547,1,290,0.53016453382084094]
[0.5031318492579161,"croce",548,0,290,0.52919708029197077]
[0.96582060149657356,"croce",549,0,290,0.52823315118397085]
[0.74278572251099306,"croce",550,0,290,0.52727272727272723]
[0.86777924853664745,"croce",551,0,290,0.52631578947368418]
[0.14085118883357672,"testa",552,1,291,0.52717391304347827]
[0.76996198570255703,"croce",553,0,291,0.52622061482820981]
[0.14684770679760617,"testa",554,1,292,0.52707581227436828]
[0.38348039308294291,"testa",555,1,293,0.52792792792792798]
[0.64497051457411858,"croce",556,0,293,0.5269784172661871]
[0.35395011149689792,"testa",557,1,294,0.52782764811490124]
[0.30509973953970271,"testa",558,1,295,0.52867383512544808]
[0.83551213475741759,"croce",559,0,295,0.52772808586762077]
[0.33736881230523119,"testa",560,1,296,0.52857142857142858]
[0.37027432695016116,"testa",561,1,297,0.52941176470588236]
[0.85120380653598682,"croce",562,0,297,0.52846975088967973]
[0.40011562178311233,"testa",563,1,298,0.52930728241563052]
[0.26056896786462691,"testa",564,1,299,0.53014184397163122]
[0.36037788281257888,"testa",565,1,300,0.53097345132743368]
[0.42325817023702361,"testa",566,1,301,0.53180212014134276]
[0.35987455009246139,"testa",567,1,302,0.53262786596119926]
[0.63861100661335446,"croce",568,0,302,0.53169014084507038]
[0.28447264814990125,"testa",569,1,303,0.5325131810193322]
[0.56543809302433157,"croce",570,0,303,0.53157894736842104]
[0.57684983577557092,"croce",571,0,303,0.53064798598949214]
[0.88828016596462611,"croce",572,0,303,0.52972027972027969]
[0.13374475437365541,"testa",573,1,304,0.53054101221640493]
[0.49646841882559201,"testa",574,1,305,0.53135888501742157]
[0.24066581013818877,"testa",575,1,306,0.53217391304347827]
[0.8230250808809455,"croce",576,0,306,0.53125]
[0.31652087822781361,"testa",577,1,307,0.53206239168110914]
[{"$f":"RAND()","v":0.15473240396975274},{"$f":"IF(A579<0.5,\"testa\",\"croce\")","v":"testa"},578,1,308,0.53287197231833905]
[0.56164476441946354,"croce",579,0,308,0.53195164075993095]
[0.90950883293789542,"croce",580,0,308,0.53103448275862064]
[0.15469161576168711,"testa",581,1,309,0.53184165232358005]
[3.2047918472939529E-2,"testa",582,1,310,0.53264604810996563]
[0.68690178093083654,"croce",583,0,310,0.53173241852487141]
[0.29351803585757474,"testa",584,1,311,0.53253424657534243]
[0.98079247049185991,"croce",585,0,311,0.53162393162393162]
[0.87275415825646774,"croce",586,0,311,0.53071672354948807]
[7.3746148942811507E-2,"testa",{"$f":"C587+1","v":587},{"$f":"IF(B588=\"testa\",1,0)","v":1},{"$f":"E587+D588","v":312},{"$f":"E588/C588","v":0.53151618398637135}]
[0.24524933066551735,"testa",588,1,313,0.53231292517006801]
[9.724130679094567E-2,"testa",589,1,314,0.53310696095076404]
[0.95115856846910007,"croce",590,0,314,0.53220338983050852]
[0.25556397167461353,"testa",591,1,315,0.53299492385786806]
[0.60361632359139872,"croce",592,0,315,0.53209459459459463]
[0.16210423426761067,"testa",593,1,316,0.53288364249578413]
[0.28242601543796686,"testa",594,1,317,0.53367003367003363]
[0.82454140344984039,"croce",595,0,317,0.53277310924369747]
[0.17913434287777541,"testa",596,1,318,0.53355704697986572]
[0.73556103563833652,"croce",597,0,318,0.53266331658291455]
[0.54066111780659065,"croce",598,0,318,0.5317725752508361]
[0.77283328711270949,"croce",599,0,318,0.53088480801335558]
[0.43552847204914624,"testa",600,1,319,0.53166666666666662]
[0.66424750263064447,"croce",601,0,319,0.53078202995008317]
[0.71293843311995941,"croce",602,0,319,0.5299003322259136]
[0.91961422689865602,"croce",603,0,319,0.52902155887230518]
[0.46451461194938115,"testa",604,1,320,0.5298013245033113]
[0.71741969292698837,"croce",605,0,320,0.52892561983471076]
[0.77416589989431672,"croce",606,0,320,0.528052805280528]
[0.69800045386947829,"croce",607,0,320,0.52718286655683688]
[0.19147884955646888,"testa",608,1,321,0.52796052631578949]
[0.83709314873339269,"croce",609,0,321,0.52709359605911332]
[0.12609545941769917,"testa",610,1,322,0.52786885245901638]
[0.14625028961319841,"testa",611,1,323,0.52864157119476274]
[0.64294901011875327,"croce",612,0,323,0.52777777777777779]
[0.16393611605479175,"testa",613,1,324,0.52854812398042417]
[6.1585801482025748E-2,"testa",614,1,325,0.52931596091205213]
[0.24045557357997627,"testa",615,1,326,0.53008130081300808]
[0.30423859646312024,"testa",616,1,327,0.5308441558441559]
[0.33473780276351772,"testa",617,1,328,0.53160453808752028]
[1.3103582537112635E-2,"testa",618,1,329,0.53236245954692551]
[0.91008945157707899,"croce",619,0,329,0.53150242326332797]
[0.44450142317809715,"testa",620,1,330,0.532258064516129]
[0.40389690578274251,"testa",621,1,331,0.53301127214170696]
[0.45111150750207474,"testa",622,1,332,0.5337620578778135]
[0.41030390517554371,"testa",623,1,333,0.5345104333868379]
[0.46492374197334219,"testa",624,1,334,0.53525641025641024]
[0.45231709020539612,"testa",625,1,335,0.53600000000000003]
[0.45783788971898276,"testa",626,1,336,0.53674121405750796]
[0.4385060276034386,"testa",627,1,337,0.53748006379585322]
[0.46799020898635224,"testa",628,1,338,0.53821656050955413]
[0.52934180858225455,"croce",629,0,338,0.5373608903020668]
[0.33359972677349603,"testa",630,1,339,0.53809523809523807]
[0.7264060241054886,"croce",631,0,339,0.53724247226624411]
[0.87470405521244887,"croce",632,0,339,0.53639240506329111]
[0.65799477090746139,"croce",633,0,339,0.53554502369668244]
[0.22203387366832661,"testa",634,1,340,0.5362776025236593]
[0.17448679967198399,"testa",635,1,341,0.53700787401574801]
[0.81473959686889263,"croce",636,0,341,0.53616352201257866]
[9.2065103446546059E-2,"testa",637,1,342,0.53689167974882257]
[0.89754129878903444,"croce",638,0,342,0.53605015673981193]
[0.76366228988549567,"croce",639,0,342,0.53521126760563376]
[0.17766324379396292,"testa",640,1,343,0.53593749999999996]
[0.34637187843540562,"testa",641,1,344,0.53666146645865831]
[{"$f":"RAND()","v":0.87221975791885531},{"$f":"IF(A643<0.5,\"testa\",\"croce\")","v":"croce"},642,0,344,0.53582554517133951]
[0.4891300986335122,"testa",643,1,345,0.53654743390357695]
[0.13263336260717495,"testa",644,1,346,0.53726708074534157]
[0.46250314357591737,"testa",645,1,347,0.53798449612403099]
[0.36091888748664136,"testa",646,1,348,0.53869969040247678]
[0.81086318150510572,"croce",647,0,348,0.53786707882534779]
[0.33473021029333083,"testa",648,1,349,0.5385802469135802]
[0.69350417264887709,"croce",649,0,349,0.53775038520801233]
[0.30803312812512185,"testa",650,1,350,0.53846153846153844]
[0.6983506575574614,"croce",{"$f":"C651+1","v":651},{"$f":"IF(B652=\"testa\",1,0)","v":0},{"$f":"E651+D652","v":350},{"$f":"E652/C652","v":0.5376344086021505}]
[0.46552485447959246,"testa",652,1,351,0.53834355828220859]
[3.7831137279497606E-2,"testa",653,1,352,0.53905053598774888]
[0.36303410611959508,"testa",654,1,353,0.53975535168195721]
[0.92190434097939555,"croce",655,0,353,0.53893129770992365]
[0.44152588052223041,"testa",656,1,354,0.53963414634146345]
[0.79025527879157342,"croce",657,0,354,0.53881278538812782]
[0.31883829820827947,"testa",658,1,355,0.53951367781155013]
[0.81890258954168027,"croce",659,0,355,0.53869499241274654]
[0.6627966918824002,"croce",660,0,355,0.53787878787878785]
[0.97310681266098698,"croce",661,0,355,0.53706505295007567]
[0.11037373362739722,"testa",662,1,356,0.53776435045317217]
[0.46597064316211156,"testa",663,1,357,0.53846153846153844]
[0.10612989501647607,"testa",664,1,358,0.53915662650602414]
[0.97499211030190913,"croce",665,0,358,0.53834586466165413]
[0.23173095871246174,"testa",666,1,359,0.53903903903903905]
[0.97888685743526349,"croce",667,0,359,0.53823088455772117]
[0.88273119180179049,"croce",668,0,359,0.53742514970059885]
[0.9155946102708773,"croce",669,0,359,0.53662182361733934]
[0.46189479490666296,"testa",670,1,360,0.53731343283582089]
[0.59184325454176301,"croce",671,0,360,0.53651266766020866]
[0.6805415857485444,"croce",672,0,360,0.5357142857142857]
[0.55784719359829704,"croce",673,0,360,0.53491827637444278]
[0.20809110080024473,"testa",674,1,361,0.53560830860534125]
[0.77884896509689294,"croce",675,0,361,0.53481481481481485]
[0.11385646721956255,"testa",676,1,362,0.53550295857988162]
[0.45419799818839501,"testa",677,1,363,0.53618906942392908]
[0.5961817782158485,"croce",678,0,363,0.53539823008849563]
[0.42147591686304064,"testa",679,1,364,0.53608247422680411]
[0.75141127282642661,"croce",680,0,364,0.53529411764705881]
[3.3579375076843165E-2,"testa",681,1,365,0.53597650513950068]
[0.23045085236298946,"testa",682,1,366,0.53665689149560114]
[0.69160416618518816,"croce",683,0,366,0.5358711566617862]
[0.30570521848567933,"testa",684,1,367,0.53654970760233922]
[0.76357842765998307,"croce",685,0,367,0.53576642335766422]
[0.36475461819110333,"testa",686,1,368,0.53644314868804666]
[0.58647940490972517,"croce",687,0,368,0.53566229985443958]
[5.3212221817277805E-2,"testa",688,1,369,0.53633720930232553]
[0.73422092780973536,"croce",689,0,369,0.53555878084179975]
[0.12573786760293681,"testa",690,1,370,0.53623188405797106]
[0.75833100606437509,"croce",691,0,370,0.5354558610709117]
[0.68177785052272732,"croce",692,0,370,0.53468208092485547]
[0.31501094969208876,"testa",693,1,371,0.53535353535353536]
[0.7360078433928231,"croce",694,0,371,0.53458213256484155]
[0.47419718451084136,"testa",695,1,372,0.53525179856115113]
[0.23696433997707511,"testa",696,1,373,0.53591954022988508]
[0.86676159302348899,"croce",697,0,373,0.5351506456241033]
[0.49690145921480433,"testa",698,1,374,0.53581661891117482]
[0.92988354479261692,"croce",699,0,374,0.53505007153075823]
[8.3379211209259285E-2,"testa",700,1,375,0.5357142857142857]
[0.65655855090356585,"croce",701,0,375,0.53495007132667616]
[0.52735686703461593,"croce",702,0,375,0.53418803418803418]
[0.53577199153431521,"croce",703,0,375,0.53342816500711232]
[0.13039286455682197,"testa",704,1,376,0.53409090909090906]
[0.23841683440307837,"testa",705,1,377,0.53475177304964538]
[{"$f":"RAND()","v":0.4919460915404632},{"$f":"IF(A707<0.5,\"testa\",\"croce\")","v":"testa"},706,1,378,0.53541076487252126]
[0.83870134598836765,"croce",707,0,378,0.53465346534653468]
[0.75207211329185675,"croce",708,0,378,0.53389830508474578]
[0.44974456105642691,"testa",709,1,379,0.5345557122708039]
[0.62922059058320323,"croce",710,0,379,0.53380281690140841]
[0.13856294317596241,"testa",711,1,380,0.5344585091420534]
[0.94900965314945007,"croce",712,0,380,0.5337078651685393]
[0.57533709660383348,"croce",713,0,380,0.53295932678821878]
[0.73928027898248672,"croce",714,0,380,0.53221288515406162]
[0.56418734666600612,"croce",{"$f":"C715+1","v":715},{"$f":"IF(B716=\"testa\",1,0)","v":0},{"$f":"E715+D716","v":380},{"$f":"E716/C716","v":0.53146853146853146}]
[0.82966405310175817,"croce",716,0,380,0.53072625698324027]
[0.45093663784228244,"testa",717,1,381,0.53138075313807531]
[0.79690634196710142,"croce",718,0,381,0.53064066852367686]
[0.27872448911635606,"testa",719,1,382,0.53129346314325454]
[0.32777326528022765,"testa",720,1,383,0.53194444444444444]
[0.19652903027940793,"testa",721,1,384,0.53259361997226073]
[0.10256092290822783,"testa",722,1,385,0.53324099722991691]
[0.43992399813462002,"testa",723,1,386,0.53388658367911479]
[0.73080014088789624,"croce",724,0,386,0.53314917127071826]
[0.89901597548625523,"croce",725,0,386,0.53241379310344827]
[0.66257158020840412,"croce",726,0,386,0.5316804407713499]
[0.13499641896931747,"testa",727,1,387,0.53232462173314998]
[0.63151902825825956,"croce",728,0,387,0.53159340659340659]
[0.50005064258067666,"croce",729,0,387,0.53086419753086422]
[0.50560846714045404,"croce",730,0,387,0.53013698630136985]
[0.37555270055485379,"testa",731,1,388,0.53077975376196995]
[0.73557151317082548,"croce",732,0,388,0.5300546448087432]
[0.14752851109431886,"testa",733,1,389,0.53069577080491137]
[0.23462370265948373,"testa",734,1,390,0.53133514986376018]
[0.90755186123535847,"croce",735,0,390,0.53061224489795922]
[1.8710504207616108E-2,"testa",736,1,391,0.53125]
[0.85866802216808646,"croce",737,0,391,0.53052917232021712]
[0.98383003595545582,"croce",738,0,391,0.52981029810298108]
[0.60404076864515344,"croce",739,0,391,0.52909336941813256]
[0.84461423400508395,"croce",740,0,391,0.52837837837837842]
[0.89564159983458702,"croce",741,0,391,0.52766531713900133]
[0.99483110016501641,"croce",742,0,391,0.52695417789757415]
[0.44265489762583288,"testa",743,1,392,0.52759084791386268]
[0.82831202349623434,"croce",744,0,392,0.5268817204301075]
[0.58525570150494743,"croce",745,0,392,0.52617449664429528]
[0.89647568119236531,"croce",746,0,392,0.52546916890080431]
[0.72511938490828343,"croce",747,0,392,0.52476572958500667]
[6.9793314901502979E-2,"testa",748,1,393,0.52540106951871657]
[3.474856680442262E-2,"testa",749,1,394,0.52603471295060078]
[0.34430150066310838,"testa",750,1,395,0.52666666666666662]
[0.49470057755387831,"testa",751,1,396,0.52729693741677763]
[0.17515462356645062,"testa",752,1,397,0.52792553191489366]
[0.11729706258686268,"testa",753,1,398,0.5285524568393094]
[0.41390392091433437,"testa",754,1,399,0.52917771883289122]
[0.67624558930212886,"croce",755,0,399,0.52847682119205297]
[3.3503499746105336E-2,"testa",756,1,400,0.52910052910052907]
[4.1765129167596227E-2,"testa",757,1,401,0.52972258916776749]
[0.19359499248191159,"testa",758,1,402,0.53034300791556732]
[6.2352808205210497E-3,"testa",759,1,403,0.53096179183135706]
[0.32461018754463644,"testa",760,1,404,0.53157894736842104]
[0.1716027943997549,"testa",761,1,405,0.53219448094612354]
[7.9990679880064031E-2,"testa",762,1,406,0.53280839895013121]
[0.41425321278126237,"testa",763,1,407,0.53342070773263439]
[1.1844945568343146E-2,"testa",764,1,408,0.53403141361256545]
[0.94875728419657912,"croce",765,0,408,0.53333333333333333]
[0.63345270138268484,"croce",766,0,408,0.53263707571801566]
[0.66493450738234428,"croce",767,0,408,0.5319426336375489]
[0.90606495680823007,"croce",768,0,408,0.53125]
[5.952631577087697E-2,"testa",769,1,409,0.53185955786736017]
[{"$f":"RAND()","v":0.58192690852700024},{"$f":"IF(A771<0.5,\"testa\",\"croce\")","v":"croce"},770,0,409,0.53116883116883118]
[0.24859737442624819,"testa",771,1,410,0.5317769130998703]
[0.85634778098371211,"croce",772,0,410,0.5310880829015544]
[0.7110283738024934,"croce",773,0,410,0.5304010349288486]
[0.66000182409081287,"croce",774,0,410,0.52971576227390182]
[0.5096701063704967,"croce",775,0,410,0.52903225806451615]
[0.91173442301675034,"croce",776,0,410,0.52835051546391754]
[0.70958875254238374,"croce",777,0,410,0.52767052767052769]
[0.81395257148513467,"croce",778,0,410,0.52699228791773778]
[0.82708554872366413,"croce",{"$f":"C779+1","v":779},{"$f":"IF(B780=\"testa\",1,0)","v":0},{"$f":"E779+D780","v":410},{"$f":"E780/C780","v":0.52631578947368418}]
[0.46119803220817479,"testa",780,1,411,0.52692307692307694]
[0.37125734308050173,"testa",781,1,412,0.52752880921895007]
[0.42408739150863084,"testa",782,1,413,0.52813299232736577]
[8.8180324605403482E-2,"testa",783,1,414,0.52873563218390807]
[0.68337219890792256,"croce",784,0,414,0.52806122448979587]
[0.40780403899036433,"testa",785,1,415,0.5286624203821656]
[0.82774589729265802,"croce",786,0,415,0.52798982188295163]
[0.66372645200548652,"croce",787,0,415,0.52731893265565444]
[0.34539712170426962,"testa",788,1,416,0.52791878172588835]
[0.32546396098874641,"testa",789,1,417,0.52851711026615966]
[1.5887815562205976E-2,"testa",790,1,418,0.52911392405063296]
[0.58432078780587116,"croce",791,0,418,0.52844500632111246]
[0.7690234866921184,"croce",792,0,418,0.52777777777777779]
[0.88838284993260841,"croce",793,0,418,0.5271122320302648]
[0.96797899962088096,"croce",794,0,418,0.52644836272040307]
[0.23740815855831887,"testa",795,1,419,0.5270440251572327]
[0.74134167177878607,"croce",796,0,419,0.52638190954773867]
[0.52419410088182428,"croce",797,0,419,0.52572145545796733]
[0.30838909243987855,"testa",798,1,420,0.52631578947368418]
[0.75387190797355619,"croce",799,0,420,0.52565707133917394]
[0.92307810163438375,"croce",800,0,420,0.52500000000000002]
[0.22347759581953075,"testa",801,1,421,0.52559300873907611]
[0.96474553915263217,"croce",802,0,421,0.52493765586034913]
[0.95654093587263034,"croce",803,0,421,0.52428393524283934]
[0.39651471577961317,"testa",804,1,422,0.52487562189054726]
[0.98612589425989772,"croce",805,0,422,0.52422360248447208]
[0.72756575101822463,"croce",806,0,422,0.52357320099255578]
[5.0943559112814563E-2,"testa",807,1,423,0.52416356877323422]
[7.9359137531038959E-2,"testa",808,1,424,0.52475247524752477]
[0.93167839325190627,"croce",809,0,424,0.52410383189122378]
[0.70275290980129845,"croce",810,0,424,0.52345679012345681]
[0.40594253586471385,"testa",811,1,425,0.52404438964241673]
[0.50551382726990013,"croce",812,0,425,0.52339901477832518]
[0.27194612843880395,"testa",813,1,426,0.52398523985239853]
[0.18907009259372931,"testa",814,1,427,0.52457002457002455]
[0.26723219237115758,"testa",815,1,428,0.5251533742331288]
[0.46924438899505994,"testa",816,1,429,0.52573529411764708]
[0.28094052278180792,"testa",817,1,430,0.52631578947368418]
[0.35385338862835625,"testa",818,1,431,0.52689486552567233]
[0.68169083787656981,"croce",819,0,431,0.52625152625152627]
[0.2447374212622383,"testa",820,1,432,0.52682926829268295]
[5.441542467459537E-2,"testa",821,1,433,0.52740560292326433]
[0.73312327344576667,"croce",822,0,433,0.52676399026763987]
[0.37922909375792846,"testa",823,1,434,0.52733900364520048]
[0.20939009303521983,"testa",824,1,435,0.52791262135922334]
[0.50066434526485071,"croce",825,0,435,0.52727272727272723]
[7.492468533801E-2,"testa",826,1,436,0.52784503631961255]
[0.89352831932408183,"croce",827,0,436,0.52720677146311967]
[0.39964134742237856,"testa",828,1,437,0.52777777777777779]
[0.66851911179160017,"croce",829,0,437,0.52714113389626061]
[0.12544042388514542,"testa",830,1,438,0.52771084337349394]
[0.53217186885576639,"croce",831,0,438,0.52707581227436828]
[0.51593764650718754,"croce",832,0,438,0.52644230769230771]
[0.63237712077226171,"croce",833,0,438,0.5258103241296519]
[{"$f":"RAND()","v":0.75775774790083872},{"$f":"IF(A835<0.5,\"testa\",\"croce\")","v":"croce"},834,0,438,0.52517985611510787]
[0.49900853196093675,"testa",835,1,439,0.52574850299401199]
[0.75426161641178913,"croce",836,0,439,0.52511961722488043]
[0.23387598158116063,"testa",837,1,440,0.52568697729988056]
[0.3497831488614046,"testa",838,1,441,0.52625298329355608]
[0.27629827425285369,"testa",839,1,442,0.52681764004767584]
[0.49069050453991347,"testa",840,1,443,0.52738095238095239]
[8.4634287934587826E-2,"testa",841,1,444,0.5279429250891795]
[0.60687901995846905,"croce",842,0,444,0.52731591448931114]
[0.18401268908816626,"testa",{"$f":"C843+1","v":843},{"$f":"IF(B844=\"testa\",1,0)","v":1},{"$f":"E843+D844","v":445},{"$f":"E844/C844","v":0.52787663107947802}]
[0.97091788092217368,"croce",844,0,445,0.52725118483412325]
[0.99570804694443515,"croce",845,0,445,0.52662721893491127]
[0.97985317905276259,"croce",846,0,445,0.52600472813238774]
[0.6476663810061648,"croce",847,0,445,0.52538370720188898]
[0.22001361285334875,"testa",848,1,446,0.52594339622641506]
[0.98320745482477034,"croce",849,0,446,0.52532391048292104]
[0.45613694483263012,"testa",850,1,447,0.52588235294117647]
[6.6089390621397071E-2,"testa",851,1,448,0.52643948296122212]
[0.81297275554037518,"croce",852,0,448,0.5258215962441315]
[0.70118932506258513,"croce",853,0,448,0.52520515826494729]
[0.37443127452668401,"testa",854,1,449,0.52576112412177989]
[3.354246816864348E-2,"testa",855,1,450,0.52631578947368418]
[0.80329052043697524,"croce",856,0,450,0.52570093457943923]
[0.24641041564905919,"testa",857,1,451,0.52625437572928824]
[0.64885395386086209,"croce",858,0,451,0.52564102564102566]
[0.68629455796032579,"croce",859,0,451,0.52502910360884747]
[0.99482648362416348,"croce",860,0,451,0.52441860465116275]
[0.90407156986817538,"croce",861,0,451,0.52380952380952384]
[0.37988021701438779,"testa",862,1,452,0.52436194895591648]
[0.35321621830337702,"testa",863,1,453,0.52491309385863272]
[0.42334412886264583,"testa",864,1,454,0.52546296296296291]
[0.2233741366429649,"testa",865,1,455,0.52601156069364163]
[0.7993902829298698,"croce",866,0,455,0.52540415704387988]
[0.4906772587696645,"testa",867,1,456,0.52595155709342556]
[0.23390552768197626,"testa",868,1,457,0.52649769585253459]
[0.86638784422922965,"croce",869,0,457,0.52589182968929804]
[0.85507394075442811,"croce",870,0,457,0.52528735632183909]
[0.66013709959609834,"croce",871,0,457,0.52468427095292769]
[0.2386781136956555,"testa",872,1,458,0.52522935779816515]
[0.65802348275702227,"croce",873,0,458,0.52462772050400919]
[0.68294829835099224,"croce",874,0,458,0.52402745995423339]
[0.2480410786864079,"testa",875,1,459,0.52457142857142858]
[0.38766566242291012,"testa",876,1,460,0.52511415525114158]
[0.67656850860007145,"croce",877,0,460,0.52451539338654507]
[0.11731425488731073,"testa",878,1,461,0.52505694760820043]
[0.61222403297349448,"croce",879,0,461,0.52445961319681456]
[0.73758153939744031,"croce",880,0,461,0.52386363636363631]
[0.63785900400133611,"croce",881,0,461,0.52326901248581159]
[0.2415806610965503,"testa",882,1,462,0.52380952380952384]
[0.42169523474431259,"testa",883,1,463,0.52434881087202723]
[0.67586519052722105,"croce",884,0,463,0.52375565610859731]
[0.14776065985874498,"testa",885,1,464,0.52429378531073445]
[0.23147068153345396,"testa",886,1,465,0.52483069977426633]
[0.76431556662971234,"croce",887,0,465,0.52423900789177003]
[0.4154723108903583,"testa",888,1,466,0.52477477477477474]
[0.51844440891771559,"croce",889,0,466,0.5241844769403825]
[0.90885809617723268,"croce",890,0,466,0.52359550561797752]
[0.85390266482944266,"croce",891,0,466,0.52300785634118963]
[0.2141978729195092,"testa",892,1,467,0.523542600896861]
[0.85006838204340074,"croce",893,0,467,0.52295632698768202]
[0.68361093512952009,"croce",894,0,467,0.52237136465324385]
[0.51551079693228896,"croce",895,0,467,0.52178770949720665]
[0.53544685725911534,"croce",896,0,467,0.5212053571428571]
[0.17012151196862269,"testa",897,1,468,0.52173913043478259]
[{"$f":"RAND()","v":0.54185494140603174},{"$f":"IF(A899<0.5,\"testa\",\"croce\")","v":"croce"},898,0,468,0.52115812917594651]
[5.2269597530169576E-2,"testa",899,1,469,0.52169076751946608]
[0.52302963631807498,"croce",900,0,469,0.52111111111111108]
[2.0432278439042051E-2,"testa",901,1,470,0.52164261931187572]
[0.21454217642516438,"testa",902,1,471,0.52217294900221733]
[5.6641133664223853E-2,"testa",903,1,472,0.52270210409745288]
[0.81671493664883865,"croce",904,0,472,0.52212389380530977]
[0.41820659693835061,"testa",905,1,473,0.52265193370165741]
[9.9159698806093433E-2,"testa",906,1,474,0.52317880794701987]
[0.84692975787840385,"croce",{"$f":"C907+1","v":907},{"$f":"IF(B908=\"testa\",1,0)","v":0},{"$f":"E907+D908","v":474},{"$f":"E908/C908","v":0.52260198456449836}]
[0.81141019821937543,"croce",908,0,474,0.52202643171806162]
[0.60062806957638704,"croce",909,0,474,0.52145214521452143]
[0.64132391331242078,"croce",910,0,474,0.52087912087912092]
[0.33403066785142399,"testa",911,1,475,0.52140504939626786]
[0.50335033638906268,"croce",912,0,475,0.52083333333333337]
[0.45915795549874394,"testa",913,1,476,0.52135815991237677]
[0.6422114443693514,"croce",914,0,476,0.52078774617067836]
[0.1946875081243532,"testa",915,1,477,0.52131147540983602]
[0.56044133508189176,"croce",916,0,477,0.52074235807860259]
[0.27781692095134147,"testa",917,1,478,0.52126499454743724]
[0.66905018708013797,"croce",918,0,478,0.52069716775599129]
[0.49026267160868664,"testa",919,1,479,0.5212187159956474]
[6.8045577665275636E-2,"testa",920,1,480,0.52173913043478259]
[0.58545188112347435,"croce",921,0,480,0.52117263843648209]
[1.4435144859060722E-2,"testa",922,1,481,0.52169197396963118]
[0.81711703047942863,"croce",923,0,481,0.52112676056338025]
[0.78447725063215357,"croce",924,0,481,0.52056277056277056]
[0.86483537512226005,"croce",925,0,481,0.52]
[0.185882096409414,"testa",926,1,482,0.52051835853131745]
[0.67240719289831719,"croce",927,0,482,0.51995685005393744]
[0.23907084324829941,"testa",928,1,483,0.52047413793103448]
[0.54774476210799472,"croce",929,0,483,0.51991388589881593]
[0.32720734528189455,"testa",930,1,484,0.52043010752688168]
[0.86949587263681449,"croce",931,0,484,0.51987110633727174]
[0.2089278959781985,"testa",932,1,485,0.52038626609442062]
[0.96335784102520738,"croce",933,0,485,0.51982851018220788]
[4.5081132197303808E-2,"testa",934,1,486,0.52034261241970026]
[0.56175670277913747,"croce",935,0,486,0.51978609625668448]
[0.34818152849252215,"testa",936,1,487,0.52029914529914534]
[0.85363755112430217,"croce",937,0,487,0.51974386339381007]
[0.5814464706824104,"croce",938,0,487,0.51918976545842221]
[0.16386889690085438,"testa",939,1,488,0.51970181043663477]
[0.21449401106071164,"testa",940,1,489,0.52021276595744681]
[0.43561060845315558,"testa",941,1,490,0.52072263549415521]
[0.46926369626484188,"testa",942,1,491,0.52123142250530785]
[0.34175865312041565,"testa",943,1,492,0.52173913043478259]
[0.43341878334779205,"testa",944,1,493,0.5222457627118644]
[0.73387313831353662,"croce",945,0,493,0.52169312169312165]
[0.55199636845222999,"croce",946,0,493,0.52114164904862581]
[0.35359233666557477,"testa",947,1,494,0.52164730728616682]
[0.79224741950952438,"croce",948,0,494,0.52109704641350207]
[0.98471501740792999,"croce",949,0,494,0.52054794520547942]
[0.47398589731676699,"testa",950,1,495,0.52105263157894732]
[0.51223011803875074,"croce",951,0,495,0.52050473186119872]
[0.94799481007772912,"croce",952,0,495,0.51995798319327735]
[0.18460014325486596,"testa",953,1,496,0.52046169989506819]
[0.85378424232353911,"croce",954,0,496,0.51991614255765195]
[0.80456671550117331,"croce",955,0,496,0.51937172774869111]
[0.71292808014992481,"croce",956,0,496,0.51882845188284521]
[0.41120393536699307,"testa",957,1,497,0.51933124346917448]
[3.0821965976755572E-2,"testa",958,1,498,0.51983298538622125]
[0.25803295009969029,"testa",959,1,499,0.52033368091762255]
[0.46381873258030337,"testa",960,1,500,0.52083333333333337]
[8.2704364820559428E-3,"testa",961,1,501,0.52133194588969822]
[{"$f":"RAND()","v":0.15319977673500007},{"$f":"IF(A963<0.5,\"testa\",\"croce\")","v":"testa"},962,1,502,0.5218295218295218]
[0.29562658164903555,"testa",963,1,503,0.52232606438213913]
[0.11917298961676404,"testa",964,1,504,0.52282157676348551]
[0.66916145204475852,"croce",965,0,504,0.52227979274611402]
[0.54049446609522589,"croce",966,0,504,0.52173913043478259]
[0.88618057488693036,"croce",967,0,504,0.52119958634953467]
[0.33184453963474492,"testa",968,1,505,0.52169421487603307]
[0.5773712896597567,"croce",969,0,505,0.52115583075335392]
[0.71337332816989352,"croce",970,0,505,0.52061855670103097]
[0.73634020598001115,"croce",{"$f":"C971+1","v":971},{"$f":"IF(B972=\"testa\",1,0)","v":0},{"$f":"E971+D972","v":505},{"$f":"E972/C972","v":0.52008238928939243}]
[1.1881021764653998E-2,"testa",972,1,506,0.52057613168724282]
[0.72232632585657475,"croce",973,0,506,0.52004110996916753]
[0.20738097217010965,"testa",974,1,507,0.52053388090349073]
[4.0594267181992993E-2,"testa",975,1,508,0.52102564102564097]
[0.91069938340700907,"croce",976,0,508,0.52049180327868849]
[0.38347959280750665,"testa",977,1,509,0.52098259979529171]
[0.37024930659231525,"testa",978,1,510,0.5214723926380368]
[0.9302335605791171,"croce",979,0,510,0.52093973442288044]
[0.86121261313510078,"croce",980,0,510,0.52040816326530615]
[0.7752139733905653,"croce",981,0,510,0.51987767584097855]
[0.66075237480238058,"croce",982,0,510,0.5193482688391039]
[0.88101933059565785,"croce",983,0,510,0.51881993896236012]
[0.97015055951435514,"croce",984,0,510,0.51829268292682928]
[0.74709425595895163,"croce",985,0,510,0.51776649746192893]
[0.14321641160061915,"testa",986,1,511,0.51825557809330625]
[0.27156018049268504,"testa",987,1,512,0.51874366767983793]
[0.26882340366668589,"testa",988,1,513,0.51923076923076927]
[0.5705802023436175,"croce",989,0,513,0.51870576339737107]
[0.60700955114326438,"croce",990,0,513,0.51818181818181819]
[0.21902894697723907,"testa",991,1,514,0.51866801210898084]
[0.32699909044089648,"testa",992,1,515,0.51915322580645162]
[0.55083047278483632,"croce",993,0,515,0.5186304128902316]
[0.85169662006562363,"croce",994,0,515,0.51810865191146882]
[0.27967419848445485,"testa",995,1,516,0.51859296482412065]
[0.17558854951716152,"testa",996,1,517,0.51907630522088355]
[0.16176728419496822,"testa",997,1,518,0.51955867602808425]
[0.29051501623751208,"testa",998,1,519,0.52004008016032066]
[0.10480139418628454,"testa",999,1,520,0.52052052052052056]
[0.38664226501824928,"testa",1000,1,521,0.52100000000000002]

{"sheet":"problema monete","index":2,"n_rows":1001,"n_cols":27,"rows_kept":1001,"cut":false,"hidden":false,"merged":[]}
[null,null,null,null,null,null,null,null,null,null,null,null,null,null,null,null,null,null,null,null,null,null,"n.T nei primi 10 lanci",null,null,"n.T nei primi 20 lanci"]
[{"$f":"IF(RAND()<0.5,1,0)","v":0},{"$f":"IF(RAND()<0.5,1,0)","v":0},0,0,1,1,1,1,0,1,1,0,0,1,0,0,1,0,1,1,null,{"$f":"SUM(X:X)","v":374},{"$f":"SUM(A2:J2)","v":5},{"$f":"IF(W2>=6,1,0)","v":0},{"$f":"SUM(AA:AA)","v":251},{"$f":"SUM(A2:T2)","v":10},{"$f":"IF(Z2>=12,1,0)","v":0}]
[{"$f":"IF(RAND()<0.5,1,0)","v":0},0,1,1,0,0,0,1,0,0,0,1,0,1,0,1,1,0,0,1,null,null,{"$f":"SUM(A3:J3)","v":3},{"$f":"IF(W3>=6,1,0)","v":0},null,{"$f":"SUM(A3:T3)","v":8},{"$f":"IF(Z3>=12,1,0)","v":0}]
[0,1,0,1,0,1,1,0,1,1,0,0,0,0,1,0,1,0,1,0,null,null,6,1,null,9,0]
[0,1,1,1,1,1,1,1,1,0,1,1,0,0,0,1,0,1,1,1,null,null,8,1,null,14,1]
[1,1,1,1,1,0,0,1,0,0,0,1,1,0,0,0,1,1,0,1,null,null,6,1,null,11,0]
[0,1,1,0,1,1,0,0,1,0,0,0,0,1,1,1,0,0,1,0,null,null,5,0,null,9,0]
[0,0,0,1,0,0,1,1,1,0,0,1,0,0,1,1,1,1,1,1,null,null,4,0,null,11,0]
[0,0,1,0,1,1,1,0,1,0,1,0,0,1,0,0,1,1,0,1,null,null,5,0,null,10,0]
[1,1,1,0,0,1,0,0,1,0,1,1,0,1,0,0,1,0,0,0,null,null,5,0,null,9,0]
[1,0,1,1,0,1,0,1,0,1,0,0,1,1,1,1,1,0,0,0,null,null,6,1,null,11,0]
[0,0,0,0,0,1,1,1,1,1,0,1,1,0,0,1,0,1,0,1,null,null,5,0,null,10,0]
[0,0,0,0,1,0,1,1,1,1,0,1,0,0,1,1,1,1,0,1,null,null,5,0,null,11,0]
[0,0,0,1,0,1,0,0,1,0,0,0,1,0,0,0,1,0,0,1,null,null,3,0,null,6,0]
[1,0,1,1,1,0,1,1,0,{"$f":"IF(RAND()<0.5,1,0)","v":0},0,0,1,1,1,0,0,0,0,0,null,null,6,1,null,9,0]
[0,0,0,0,0,0,1,0,1,0,1,1,0,1,0,0,0,0,0,0,null,null,2,0,null,5,0]
[1,0,1,1,1,1,0,1,1,1,1,0,1,0,0,0,1,0,1,0,null,null,8,1,null,12,1]
[1,0,1,0,1,0,0,1,1,1,0,1,0,1,1,0,0,0,0,0,null,null,6,1,null,9,0]
[0,1,1,1,0,1,0,1,0,1,1,0,1,1,1,0,1,0,1,1,null,null,6,1,null,13,1]
[0,0,0,0,1,0,0,0,0,1,0,0,1,0,1,1,0,0,1,1,null,null,2,0,null,7,0]
[1,0,1,1,1,0,1,1,0,0,1,0,1,1,0,1,0,0,0,1,null,null,6,1,null,11,0]
[0,0,0,1,1,0,1,1,1,1,1,1,1,0,0,0,0,0,1,0,null,null,6,1,null,10,0]
[0,0,1,1,1,1,0,0,0,0,1,0,0,1,1,1,0,1,0,0,null,null,4,0,null,9,0]
[0,1,0,0,0,1,0,1,1,1,1,1,1,1,0,0,0,0,1,0,null,null,5,0,null,10,0]
[1,1,0,1,1,1,1,1,1,0,0,1,0,1,0,1,1,0,1,0,null,null,8,1,null,13,1]
[0,0,1,1,0,0,0,1,1,1,0,1,1,1,1,0,0,1,0,1,null,null,5,0,null,11,0]
[1,0,1,1,0,0,0,0,1,0,0,0,1,0,1,0,1,1,0,0,null,null,4,0,null,8,0]
[1,1,1,0,0,1,0,1,0,0,1,0,0,1,0,0,1,0,0,1,null,null,5,0,null,9,0]
[0,1,1,1,1,1,0,0,0,0,1,1,1,0,1,0,1,0,1,1,null,null,5,0,null,12,1]
[1,1,0,1,0,0,0,1,1,1,1,0,0,1,0,1,0,0,0,1,null,null,6,1,null,10,0]
[0,0,{"$f":"IF(RAND()<0.5,1,0)","v":0},0,1,0,0,1,0,1,0,1,1,1,1,1,0,1,1,0,null,null,3,0,null,10,0]
[{"$f":"IF(RAND()<0.5,1,0)","v":1},1,0,0,1,1,0,0,0,0,1,0,1,0,1,1,1,1,1,1,null,null,4,0,null,12,1]
[1,1,0,1,1,0,0,0,1,0,1,1,1,1,1,0,1,0,1,1,null,null,5,0,null,13,1]
[0,0,1,0,1,0,0,0,0,1,0,0,0,0,0,1,1,0,0,1,null,null,3,0,null,6,0]
[1,1,0,1,0,1,1,1,1,1,1,1,1,0,1,0,0,1,0,0,null,null,8,1,null,13,1]
[0,0,1,0,0,0,1,0,0,0,0,1,1,0,0,0,1,0,1,0,null,null,2,0,null,6,0]
[1,0,0,1,1,0,0,1,0,1,1,1,1,0,0,1,1,0,0,1,null,null,5,0,null,11,0]
[1,1,0,1,0,0,0,1,1,1,0,1,0,1,1,1,0,1,0,1,null,null,6,1,null,12,1]
[0,1,1,1,1,1,0,0,1,0,0,0,1,1,0,1,0,0,0,0,null,null,6,1,null,9,0]
[0,0,1,0,0,1,1,1,0,1,0,1,1,0,0,0,1,1,0,1,null,null,5,0,null,10,0]
[0,1,1,1,1,0,0,0,0,0,0,1,1,0,0,0,1,0,0,1,null,null,4,0,null,8,0]
[1,1,1,0,1,0,1,0,1,0,0,0,1,1,1,0,0,0,0,1,null,null,6,1,null,10,0]
[1,1,1,1,0,0,1,0,0,0,0,0,0,1,1,1,0,0,0,0,null,null,5,0,null,8,0]
[1,1,1,1,0,1,1,1,0,0,0,0,1,1,0,1,0,0,0,0,null,null,7,1,null,10,0]
[0,0,0,0,1,1,1,0,1,1,0,0,1,0,1,0,1,1,0,1,null,null,5,0,null,10,0]
[1,0,1,0,1,0,0,0,0,1,0,0,1,0,0,1,0,1,0,0,null,null,4,0,null,7,0]
[1,1,0,0,1,1,1,0,1,1,0,0,0,0,1,{"$f":"IF(RAND()<0.5,1,0)","v":1},0,1,0,0,null,null,7,1,null,10,0]
[{"$f":"IF(RAND()<0.5,1,0)","v":1},1,1,1,0,1,1,0,1,0,0,0,1,1,1,1,0,0,1,1,null,null,7,1,null,13,1]
[1,0,1,1,0,0,1,1,0,1,0,1,0,0,0,1,1,1,0,1,null,null,6,1,null,11,0]
[1,1,0,0,1,0,0,0,0,0,1,0,1,1,1,1,0,1,0,0,null,null,3,0,null,9,0]
[1,1,1,0,1,0,0,1,0,0,1,0,1,1,0,1,1,1,1,1,null,null,5,0,null,13,1]
[0,1,1,0,0,0,0,1,1,0,1,1,1,0,0,0,0,0,0,1,null,null,4,0,null,8,0]
[1,0,1,0,1,1,1,0,0,0,0,0,0,0,0,1,1,1,1,0,null,null,5,0,null,9,0]
[0,1,1,0,0,1,1,1,0,0,1,1,1,1,1,1,1,0,0,1,null,null,5,0,null,13,1]
[1,1,1,0,1,1,0,1,1,0,0,0,1,0,1,0,0,0,1,0,null,null,7,1,null,10,0]
[0,1,0,0,1,1,1,0,1,0,1,0,1,0,0,1,0,1,1,1,null,null,5,0,null,11,0]
[0,0,0,0,0,0,1,1,0,1,1,1,1,1,0,1,1,1,0,0,null,null,3,0,null,10,0]
[0,0,0,1,0,0,0,0,1,0,1,1,0,1,1,0,0,0,0,0,null,null,2,0,null,6,0]
[0,1,1,0,0,1,1,1,0,0,0,0,0,1,0,0,1,1,1,1,null,null,5,0,null,10,0]
[0,1,0,1,0,0,0,0,0,0,1,1,1,1,0,0,0,1,1,0,null,null,2,0,null,8,0]
[1,1,0,0,0,0,0,0,1,1,0,0,1,0,0,0,1,0,1,1,null,null,4,0,null,8,0]
[1,1,0,1,1,1,0,0,0,1,0,1,0,0,0,1,1,1,1,1,null,null,6,1,null,12,1]
[0,0,0,0,0,1,0,1,0,0,1,0,0,1,0,{"$f":"IF(RAND()<0.5,1,0)","v":1},0,0,1,1,null,null,2,0,null,7,0]
[{"$f":"IF(RAND()<0.5,1,0)","v":0},0,0,1,0,0,1,1,0,0,1,0,0,1,1,0,1,1,0,0,null,null,3,0,null,8,0]
[1,0,0,0,1,0,1,1,1,1,1,0,1,0,1,1,1,0,0,1,null,null,6,1,null,12,1]
[1,1,0,1,0,1,1,0,1,1,1,1,0,0,0,1,0,1,0,1,null,null,7,1,null,12,1]
[0,1,1,1,1,0,1,1,1,1,1,0,0,1,0,0,1,0,0,1,null,null,{"$f":"SUM(A67:J67)","v":8},{"$f":"IF(W67>=6,1,0)","v":1},null,{"$f":"SUM(A67:T67)","v":12},{"$f":"IF(Z67>=12,1,0)","v":1}]
[1,1,0,0,0,1,1,0,0,0,1,0,1,0,1,0,0,1,1,1,null,null,4,0,null,10,0]
[0,0,1,0,1,0,0,1,1,0,0,1,0,0,0,1,1,0,0,1,null,null,4,0,null,8,0]
[1,0,0,1,0,0,0,1,0,1,0,1,0,1,0,0,0,0,0,0,null,null,4,0,null,6,0]
[1,0,1,1,1,1,1,1,0,1,1,0,1,0,0,0,1,1,0,0,null,null,8,1,null,12,1]
[0,0,0,0,0,1,1,0,1,1,0,0,1,0,1,0,1,1,0,1,null,null,4,0,null,9,0]
[1,0,0,1,1,1,0,0,0,0,0,0,1,1,1,1,1,0,0,1,null,null,4,0,null,10,0]
[0,0,0,1,1,1,0,0,0,1,1,0,0,1,1,1,0,0,1,0,null,null,4,0,null,9,0]
[1,0,0,1,0,1,1,0,1,1,0,0,0,1,0,0,1,0,0,0,null,null,6,1,null,8,0]
[0,1,1,1,1,1,0,1,1,1,0,0,1,1,1,1,1,0,1,0,null,null,8,1,null,14,1]
[0,1,0,0,0,1,1,0,1,1,1,0,1,1,1,0,0,1,1,1,null,null,5,0,null,12,1]
[1,1,1,0,0,1,1,0,1,1,0,0,1,1,0,1,1,0,0,0,null,null,7,1,null,11,0]
[0,1,1,1,1,0,0,1,0,1,0,1,0,0,1,{"$f":"IF(RAND()<0.5,1,0)","v":1},0,1,1,0,null,null,6,1,null,11,0]
[{"$f":"IF(RAND()<0.5,1,0)","v":0},1,1,0,1,1,0,1,1,0,0,0,0,1,1,0,0,1,0,0,null,null,6,1,null,9,0]
[0,0,0,0,0,1,1,0,0,1,0,1,1,1,0,1,1,0,1,1,null,null,3,0,null,10,0]
[0,0,1,0,0,1,1,0,0,1,1,0,0,1,0,0,0,1,1,0,null,null,4,0,null,8,0]
[0,0,1,0,1,1,1,0,1,1,0,1,1,0,0,1,0,0,0,0,null,null,6,1,null,9,0]
[0,1,1,0,1,1,1,1,1,0,1,0,1,0,0,0,1,1,0,0,null,null,7,1,null,11,0]
[1,0,1,0,1,1,1,1,0,1,1,1,1,1,1,0,0,0,1,1,null,null,7,1,null,14,1]
[0,0,1,1,0,1,0,0,0,1,0,0,0,1,1,0,1,1,1,1,null,null,4,0,null,10,0]
[1,0,1,0,1,0,1,0,1,1,0,0,1,1,0,1,1,0,0,1,null,null,6,1,null,11,0]
[0,1,1,1,1,1,0,1,0,0,0,1,1,0,1,0,0,1,1,1,null,null,6,1,null,12,1]
[1,1,0,1,0,0,0,1,1,0,0,0,0,1,1,1,0,0,1,1,null,null,5,0,null,10,0]
[0,1,0,0,0,1,0,0,0,0,1,0,0,0,1,0,0,0,1,0,null,null,2,0,null,5,0]
[1,1,0,0,1,0,1,0,0,1,1,0,0,1,1,1,0,0,1,1,null,null,5,0,null,11,0]
[1,0,0,0,0,1,0,0,0,1,1,0,1,1,0,0,1,1,0,1,null,null,3,0,null,9,0]
[1,0,1,1,0,1,1,0,1,0,0,0,1,0,1,0,1,1,1,0,null,null,6,1,null,11,0]
[0,1,0,1,0,1,1,1,0,1,1,1,1,1,1,0,0,0,0,1,null,null,6,1,null,12,1]
[0,0,0,1,1,0,0,0,0,0,0,1,1,1,1,{"$f":"IF(RAND()<0.5,1,0)","v":1},0,0,1,0,null,null,2,0,null,8,0]
[{"$f":"IF(RAND()<0.5,1,0)","v":0},0,0,1,1,1,0,0,0,1,1,1,0,1,1,1,0,0,1,1,null,null,4,0,null,11,0]
[0,1,0,1,1,0,0,1,1,1,0,1,1,1,0,1,1,0,0,1,null,null,6,1,null,12,1]
[1,0,1,1,1,1,0,0,1,0,1,1,0,1,0,1,1,0,0,1,null,null,6,1,null,12,1]
[1,0,0,1,0,1,1,0,1,1,0,1,0,1,1,1,1,0,0,0,null,null,6,1,null,11,0]
[0,0,1,0,1,0,1,0,0,0,1,0,0,1,1,1,1,0,1,1,null,null,3,0,null,10,0]
[0,0,1,1,1,1,1,0,1,1,0,0,0,0,1,0,0,1,1,0,null,null,7,1,null,10,0]
[0,0,0,0,1,0,1,0,1,1,0,0,1,0,1,1,1,1,1,1,null,null,4,0,null,11,0]
[1,1,0,0,1,1,0,1,0,1,0,0,1,0,1,1,1,0,0,1,null,null,6,1,null,11,0]
[0,1,0,0,0,0,1,1,1,1,1,1,1,1,1,0,0,0,0,1,null,null,5,0,null,11,0]
[1,0,0,0,0,1,0,1,1,1,1,0,1,1,1,0,1,1,1,0,null,null,5,0,null,12,1]
[1,0,0,0,0,1,0,1,1,1,1,1,1,0,0,0,0,1,1,1,null,null,5,0,null,11,0]
[0,0,0,0,0,0,1,1,0,0,0,1,0,0,1,1,1,0,0,0,null,null,2,0,null,6,0]
[0,1,1,1,0,1,0,0,0,0,1,0,1,0,1,0,1,1,1,1,null,null,4,0,null,11,0]
[0,0,1,1,1,0,0,1,1,0,0,1,1,1,1,0,1,1,1,0,null,null,5,0,null,12,1]
[1,0,1,1,1,0,1,0,1,1,0,0,1,0,0,1,1,1,1,1,null,null,7,1,null,13,1]
[0,1,1,0,1,1,1,1,1,1,1,0,0,1,0,{"$f":"IF(RAND()<0.5,1,0)","v":0},0,0,1,1,null,null,8,1,null,12,1]
[{"$f":"IF(RAND()<0.5,1,0)","v":0},0,0,1,1,1,1,0,1,0,0,1,0,0,0,1,0,0,0,0,null,null,5,0,null,7,0]
[1,1,0,0,1,0,1,1,1,1,1,1,0,0,1,0,0,1,1,1,null,null,7,1,null,13,1]
[0,1,0,0,0,1,0,1,0,0,1,0,0,0,1,0,0,1,1,1,null,null,3,0,null,8,0]
[0,1,1,1,0,1,0,0,0,1,1,1,0,0,0,1,0,0,0,0,null,null,5,0,null,8,0]
[0,0,1,0,0,1,1,1,1,1,1,1,1,0,0,0,1,0,0,0,null,null,6,1,null,10,0]
[1,1,0,0,1,1,0,1,0,0,0,1,1,0,0,1,0,0,0,0,null,null,5,0,null,8,0]
[1,0,1,0,1,1,1,0,1,1,0,1,1,0,0,1,1,1,1,0,null,null,7,1,null,13,1]
[1,1,0,0,1,1,0,1,1,0,1,1,0,0,1,1,1,0,1,1,null,null,6,1,null,13,1]
[0,1,1,1,0,0,0,0,1,0,1,0,0,1,1,1,0,1,1,0,null,null,4,0,null,10,0]
[1,1,0,1,0,0,0,1,1,1,1,1,1,1,1,1,0,1,1,1,null,null,6,1,null,15,1]
[1,1,1,0,1,0,0,1,1,0,0,1,0,0,1,1,1,1,1,1,null,null,6,1,null,13,1]
[1,1,1,0,0,1,0,0,1,1,0,1,1,1,0,0,1,1,1,0,null,null,6,1,null,12,1]
[1,1,1,1,0,1,1,0,1,0,0,1,1,1,0,1,1,0,1,1,null,null,7,1,null,14,1]
[1,0,1,0,0,1,0,1,0,1,1,0,0,0,1,1,0,1,1,1,null,null,5,0,null,11,0]
[0,1,1,0,0,0,1,1,1,1,1,0,1,1,0,1,0,1,0,0,null,null,6,1,null,11,0]
[0,0,0,1,0,1,0,1,0,1,1,1,1,1,0,{"$f":"IF(RAND()<0.5,1,0)","v":1},0,0,0,0,null,null,4,0,null,9,0]
[{"$f":"IF(RAND()<0.5,1,0)","v":1},0,1,0,0,1,1,0,1,0,0,1,0,1,1,0,1,0,0,0,null,null,5,0,null,9,0]
[1,1,0,1,1,0,0,1,0,1,1,0,0,0,0,0,1,1,1,1,null,null,6,1,null,11,0]
[0,0,1,1,1,0,1,0,0,1,1,0,1,1,0,0,0,1,0,1,null,null,5,0,null,10,0]
[0,1,0,0,1,1,1,1,0,0,1,0,1,0,1,1,0,1,0,1,null,null,{"$f":"SUM(A131:J131)","v":5},{"$f":"IF(W131>=6,1,0)","v":0},null,{"$f":"SUM(A131:T131)","v":11},{"$f":"IF(Z131>=12,1,0)","v":0}]
[1,1,1,0,1,0,1,0,0,0,1,1,0,0,0,0,0,1,1,1,null,null,5,0,null,10,0]
[1,0,0,1,1,0,1,0,1,0,1,0,0,1,0,0,1,1,1,1,null,null,5,0,null,11,0]
[1,1,1,0,0,1,0,1,1,1,0,0,1,0,1,0,0,1,1,1,null,null,7,1,null,12,1]
[0,0,1,0,1,1,1,0,0,0,0,0,1,0,0,1,0,1,1,1,null,null,4,0,null,9,0]
[0,1,0,1,0,1,1,1,0,1,0,0,0,1,0,1,1,1,1,0,null,null,6,1,null,11,0]
[1,1,1,0,0,1,1,0,0,0,0,1,1,0,0,0,1,0,1,0,null,null,5,0,null,9,0]
[1,0,0,1,0,1,1,0,0,0,0,0,1,0,1,1,0,1,1,0,null,null,4,0,null,9,0]
[1,1,1,0,1,1,1,1,0,1,1,1,0,0,0,1,1,1,1,1,null,null,8,1,null,15,1]
[0,1,1,0,1,1,1,1,1,1,1,1,1,1,0,1,0,1,0,1,null,null,8,1,null,15,1]
[0,0,0,1,0,0,0,1,1,1,0,1,0,1,0,1,0,0,1,0,null,null,4,0,null,8,0]
[1,0,1,1,1,1,1,0,0,1,1,1,0,1,0,1,1,1,0,0,null,null,7,1,null,13,1]
[1,1,0,0,0,1,1,0,0,1,1,1,0,0,0,{"$f":"IF(RAND()<0.5,1,0)","v":1},0,1,1,1,null,null,5,0,null,11,0]
[{"$f":"IF(RAND()<0.5,1,0)","v":0},1,0,1,0,1,1,1,1,0,0,0,0,1,0,0,0,1,1,0,null,null,6,1,null,9,0]
[0,0,1,0,0,1,0,1,0,1,1,1,0,0,1,1,1,1,0,0,null,null,4,0,null,10,0]
[0,0,0,1,1,0,1,0,0,0,0,1,0,1,0,1,0,0,0,0,null,null,3,0,null,6,0]
[1,1,0,0,1,0,0,1,0,1,1,0,1,1,0,1,1,1,1,1,null,null,5,0,null,13,1]
[1,1,1,0,1,1,1,1,1,1,0,0,0,0,1,1,0,1,1,0,null,null,9,1,null,13,1]
[0,0,1,0,0,1,0,1,0,0,0,1,0,1,1,1,0,1,0,0,null,null,3,0,null,8,0]
[1,0,0,1,0,1,0,0,1,1,1,0,1,0,1,0,1,0,1,0,null,null,5,0,null,10,0]
[1,0,0,0,0,0,0,0,0,0,0,0,1,0,1,1,1,1,1,0,null,null,1,0,null,7,0]
[1,0,1,1,1,1,1,1,1,1,1,0,1,1,0,1,0,1,1,0,null,null,9,1,null,15,1]
[0,1,0,0,0,0,1,0,0,1,0,1,0,1,0,1,0,0,0,1,null,null,3,0,null,7,0]
[1,0,0,0,1,0,1,1,1,1,0,1,0,0,1,1,1,0,1,1,null,null,6,1,null,12,1]
[0,0,0,0,1,0,0,0,1,0,0,0,1,1,1,0,0,1,1,1,null,null,2,0,null,8,0]
[0,1,1,0,1,1,1,0,1,0,1,0,1,0,0,0,0,0,1,0,null,null,6,1,null,9,0]
[0,1,1,1,0,1,1,0,1,1,0,0,0,1,0,1,0,0,0,0,null,null,7,1,null,9,0]
[1,1,1,1,1,0,0,0,1,0,0,1,1,1,0,1,0,0,1,0,null,null,6,1,null,11,0]
[0,0,1,1,1,1,1,1,0,0,0,0,0,1,0,{"$f":"IF(RAND()<0.5,1,0)","v":0},0,1,0,0,null,null,6,1,null,8,0]
[{"$f":"IF(RAND()<0.5,1,0)","v":1},0,1,1,0,0,0,0,1,0,1,0,1,0,0,0,0,0,0,1,null,null,4,0,null,7,0]
[0,0,0,1,0,0,1,1,0,1,1,0,1,0,1,1,0,0,0,0,null,null,4,0,null,8,0]
[0,1,0,1,0,1,0,0,1,0,0,0,0,1,0,0,1,1,0,0,null,null,4,0,null,7,0]
[0,1,0,0,0,0,0,1,0,0,0,1,1,1,0,1,0,1,1,1,null,null,2,0,null,9,0]
[1,1,0,1,0,1,0,1,1,0,1,0,1,1,0,1,1,1,1,1,null,null,6,1,null,14,1]
[1,1,0,0,0,0,0,0,0,0,0,0,0,1,0,0,1,0,0,0,null,null,2,0,null,4,0]
[0,0,0,0,0,1,1,1,0,1,0,0,1,0,1,0,0,1,1,0,null,null,4,0,null,8,0]
[1,1,1,1,0,1,1,1,1,0,1,1,0,0,0,0,0,1,0,1,null,null,8,1,null,12,1]
[0,0,0,0,1,0,0,0,0,1,1,1,1,1,1,0,0,0,1,1,null,null,2,0,null,9,0]
[1,1,1,0,0,1,0,1,0,1,1,1,1,0,0,0,0,0,0,0,null,null,6,1,null,9,0]
[1,0,0,0,0,1,0,0,1,1,1,1,1,0,1,1,1,0,0,1,null,null,4,0,null,11,0]
[1,1,0,1,1,1,1,1,1,1,1,1,0,1,1,1,1,0,0,0,null,null,9,1,null,15,1]
[1,1,0,1,1,0,1,0,1,0,1,0,0,0,0,1,0,1,1,0,null,null,6,1,null,10,0]
[0,0,1,1,1,1,0,1,1,0,1,0,0,0,1,1,1,1,1,0,null,null,6,1,null,12,1]
[1,0,1,1,1,0,1,0,0,1,0,1,1,1,1,0,1,0,1,1,null,null,6,1,null,13,1]
[0,1,1,1,1,1,0,0,0,0,1,0,1,0,1,{"$f":"IF(RAND()<0.5,1,0)","v":1},0,0,1,1,null,null,5,0,null,11,0]
[{"$f":"IF(RAND()<0.5,1,0)","v":1},1,0,0,1,0,0,1,1,0,0,1,1,1,0,0,0,0,0,1,null,null,5,0,null,9,0]
[1,0,1,0,1,1,1,0,0,1,0,1,0,0,1,1,0,1,0,1,null,null,6,1,null,11,0]
[1,1,0,0,1,0,1,0,1,1,1,0,1,1,0,0,1,1,1,0,null,null,6,1,null,12,1]
[1,0,1,1,1,0,1,0,0,1,0,0,1,1,0,1,1,0,0,1,null,null,6,1,null,11,0]
[1,0,0,0,1,1,1,1,1,1,0,1,0,0,1,1,1,1,1,0,null,null,7,1,null,13,1]
[1,1,0,1,0,1,1,0,0,0,1,0,1,1,0,0,0,0,0,0,null,null,5,0,null,8,0]
[0,0,1,1,1,1,0,1,1,1,1,0,1,0,1,1,1,1,1,1,null,null,7,1,null,15,1]
[1,1,0,0,1,0,1,0,0,0,1,1,1,1,0,1,1,1,0,0,null,null,4,0,null,11,0]
[1,1,0,0,1,1,1,0,1,1,1,1,0,1,1,1,0,0,0,0,null,null,7,1,null,12,1]
[1,1,0,0,0,0,1,0,0,1,1,0,1,0,1,0,1,0,0,1,null,null,4,0,null,9,0]
[1,0,0,0,1,1,1,1,0,1,1,1,1,0,1,0,0,1,0,0,null,null,6,1,null,11,0]
[0,0,1,1,0,0,1,0,0,1,0,0,1,0,0,0,0,0,1,0,null,null,4,0,null,6,0]
[1,1,1,0,0,0,1,0,0,0,1,1,1,0,0,1,0,1,0,0,null,null,4,0,null,9,0]
[0,0,0,0,0,0,0,0,0,1,0,0,0,0,0,0,1,0,0,1,null,null,1,0,null,3,0]
[1,0,0,0,1,0,0,1,0,0,1,1,1,0,1,1,1,1,0,1,null,null,3,0,null,11,0]
[0,1,1,1,1,1,0,1,0,1,1,0,1,1,1,{"$f":"IF(RAND()<0.5,1,0)","v":0},0,1,1,0,null,null,7,1,null,13,1]
[{"$f":"IF(RAND()<0.5,1,0)","v":1},0,1,1,0,1,1,1,0,0,0,0,1,0,1,1,0,0,0,0,null,null,6,1,null,9,0]
[1,1,1,1,0,0,1,1,1,1,1,1,0,0,0,0,1,0,1,0,null,null,8,1,null,12,1]
[0,0,1,0,1,0,0,1,0,0,0,1,1,1,1,1,0,0,0,1,null,null,3,0,null,9,0]
[0,1,1,0,1,1,1,1,1,0,1,1,1,0,1,1,0,0,1,1,null,null,{"$f":"SUM(A195:J195)","v":7},{"$f":"IF(W195>=6,1,0)","v":1},null,{"$f":"SUM(A195:T195)","v":14},{"$f":"IF(Z195>=12,1,0)","v":1}]
[0,1,1,0,1,0,0,1,0,1,0,0,0,1,0,1,1,0,0,0,null,null,5,0,null,8,0]
[1,0,0,1,0,0,1,0,1,0,0,0,1,1,1,1,0,1,1,0,null,null,4,0,null,10,0]
[0,1,0,1,0,1,0,1,0,0,0,1,1,1,0,0,1,1,0,0,null,null,4,0,null,9,0]
[0,1,0,1,1,1,1,0,1,0,0,0,1,0,0,0,0,1,0,0,null,null,6,1,null,8,0]
[1,1,0,0,0,0,0,1,0,1,0,1,0,1,0,0,1,0,0,1,null,null,4,0,null,8,0]
[0,1,1,1,1,0,0,0,0,0,1,0,1,1,0,0,0,1,0,1,null,null,4,0,null,9,0]
[1,0,0,1,0,0,0,0,1,0,1,1,1,1,1,1,0,1,1,0,null,null,3,0,null,11,0]
[0,1,0,1,0,1,0,0,0,1,0,0,0,0,0,0,1,0,0,0,null,null,4,0,null,5,0]
[1,1,1,0,0,0,0,1,0,1,0,1,0,1,0,0,1,1,1,1,null,null,5,0,null,11,0]
[0,0,0,1,1,1,1,1,0,1,1,1,1,0,0,0,0,0,1,1,null,null,6,1,null,11,0]
[0,0,1,0,1,0,1,1,1,0,0,1,1,0,0,0,0,1,1,1,null,null,5,0,null,10,0]
[0,0,0,0,0,1,0,1,0,0,1,0,0,0,0,{"$f":"IF(RAND()<0.5,1,0)","v":0},1,1,1,0,null,null,2,0,null,6,0]
[{"$f":"IF(RAND()<0.5,1,0)","v":1},0,1,0,0,0,0,0,1,1,1,0,0,0,1,0,1,1,0,1,null,null,4,0,null,9,0]
[1,0,0,0,0,0,1,1,1,0,1,0,1,0,1,0,0,0,0,0,null,null,4,0,null,7,0]
[1,0,0,1,1,1,0,1,1,1,1,1,1,0,1,0,0,0,1,1,null,null,7,1,null,13,1]
[0,0,1,0,0,0,0,1,0,0,0,1,0,1,0,0,0,1,1,0,null,null,2,0,null,6,0]
[1,0,0,0,0,0,1,1,0,0,0,0,1,0,1,0,0,1,0,0,null,null,3,0,null,6,0]
[0,1,1,1,0,0,1,1,0,1,1,1,1,1,1,1,0,1,0,0,null,null,6,1,null,13,1]
[0,0,0,1,0,1,0,1,0,0,0,0,0,1,0,1,0,1,1,0,null,null,3,0,null,7,0]
[0,0,1,0,0,1,0,1,0,0,0,1,1,1,0,0,0,1,1,0,null,null,3,0,null,8,0]
[1,0,0,1,1,0,0,1,0,1,1,1,0,0,0,1,0,0,0,1,null,null,5,0,null,9,0]
[0,1,0,0,0,1,1,0,0,0,1,1,0,0,0,1,1,1,1,0,null,null,3,0,null,9,0]
[1,1,0,0,0,0,1,1,0,1,1,1,1,1,0,1,0,1,1,0,null,null,5,0,null,12,1]
[0,1,1,0,1,1,0,0,1,1,1,0,1,1,0,0,1,0,0,0,null,null,6,1,null,10,0]
[0,0,1,1,1,1,1,0,1,1,1,1,1,0,1,1,0,0,0,0,null,null,7,1,null,12,1]
[0,0,0,0,1,0,0,0,0,1,1,1,0,1,0,1,0,0,0,1,null,null,2,0,null,7,0]
[0,0,0,1,0,1,1,1,0,1,0,0,0,0,0,0,1,1,0,0,null,null,5,0,null,7,0]
[0,0,0,0,0,1,0,0,1,1,1,0,1,0,0,{"$f":"IF(RAND()<0.5,1,0)","v":1},1,1,0,1,null,null,3,0,null,9,0]
[{"$f":"IF(RAND()<0.5,1,0)","v":1},0,0,0,0,0,1,1,0,0,0,1,1,1,0,1,0,0,1,1,null,null,3,0,null,9,0]
[0,1,0,0,0,0,1,0,1,1,1,1,0,0,1,1,0,0,0,1,null,null,4,0,null,9,0]
[1,0,0,0,1,1,0,0,1,0,1,0,1,0,0,1,1,1,0,1,null,null,4,0,null,10,0]
[1,0,0,1,0,0,1,0,1,1,0,0,1,1,0,1,1,1,0,1,null,null,5,0,null,11,0]
[1,1,0,0,0,0,0,1,0,1,1,0,0,0,1,0,1,1,0,0,null,null,4,0,null,8,0]
[0,1,1,1,0,1,1,0,1,0,1,1,1,0,1,1,1,1,0,0,null,null,6,1,null,13,1]
[0,0,0,0,0,0,1,0,1,0,1,1,0,0,0,1,1,1,1,1,null,null,2,0,null,9,0]
[1,1,0,0,0,1,0,0,1,1,1,0,0,1,0,1,1,1,1,0,null,null,5,0,null,11,0]
[1,0,1,1,0,1,1,0,1,0,1,0,0,1,1,0,0,0,0,1,null,null,6,1,null,10,0]
[1,1,1,0,0,1,1,1,1,1,0,1,1,0,1,1,0,0,0,0,null,null,8,1,null,12,1]
[0,1,0,0,0,0,1,1,0,0,0,1,1,1,0,0,1,0,1,0,null,null,3,0,null,8,0]
[0,0,1,0,1,0,0,0,0,0,0,0,1,0,1,1,0,1,1,0,null,null,2,0,null,7,0]
[0,1,0,1,1,0,1,1,0,1,0,0,1,1,1,0,0,1,0,0,null,null,6,1,null,10,0]
[1,1,0,1,1,0,0,0,0,0,0,0,0,0,0,0,0,1,0,0,null,null,4,0,null,5,0]
[1,1,1,1,0,1,0,0,1,1,1,0,0,0,1,1,1,1,1,1,null,null,7,1,null,14,1]
[0,1,1,1,0,1,1,1,0,1,0,1,0,0,1,{"$f":"IF(RAND()<0.5,1,0)","v":1},1,1,0,0,null,null,7,1,null,12,1]
[{"$f":"IF(RAND()<0.5,1,0)","v":0},0,0,0,1,1,0,0,0,1,1,1,0,0,0,1,1,0,1,0,null,null,3,0,null,8,0]
[0,1,1,0,0,0,0,0,0,0,0,0,0,1,0,1,0,1,0,0,null,null,2,0,null,5,0]
[1,0,1,1,1,1,1,1,0,0,0,0,0,0,1,0,0,0,0,0,null,null,7,1,null,8,0]
[0,1,0,0,1,0,0,0,1,0,1,1,0,0,1,1,0,0,1,1,null,null,3,0,null,9,0]
[1,0,0,1,1,0,1,1,1,1,1,1,1,1,0,1,1,1,1,1,null,null,7,1,null,16,1]
[0,0,1,1,0,0,1,1,0,0,0,0,0,1,1,1,0,1,1,1,null,null,4,0,null,10,0]
[1,0,1,0,0,1,1,1,0,0,1,1,0,0,0,1,1,1,0,1,null,null,5,0,null,11,0]
[1,0,0,0,0,0,1,1,0,0,0,0,0,1,0,0,1,0,0,1,null,null,3,0,null,6,0]
[0,0,1,1,0,1,1,0,0,1,0,1,0,1,1,0,0,0,0,0,null,null,5,0,null,8,0]
[0,0,1,1,1,0,0,1,1,1,0,0,1,1,1,1,1,1,0,1,null,null,6,1,null,13,1]
[0,0,0,1,1,1,1,1,1,1,1,1,0,0,1,1,0,0,0,0,null,null,7,1,null,11,0]
[1,0,0,1,0,0,1,0,0,0,0,0,0,1,0,0,0,1,1,0,null,null,3,0,null,6,0]
[1,0,0,0,0,1,1,1,1,1,1,1,1,1,0,1,1,0,1,0,null,null,6,1,null,13,1]
[0,0,0,0,1,0,0,1,1,0,1,1,1,0,1,0,1,0,0,0,null,null,3,0,null,8,0]
[1,0,0,1,1,1,0,1,0,0,1,1,0,0,0,0,0,1,1,1,null,null,5,0,null,10,0]
[0,1,1,0,0,0,1,1,1,1,0,1,0,0,1,{"$f":"IF(RAND()<0.5,1,0)","v":1},1,0,0,1,null,null,6,1,null,11,0]
[{"$f":"IF(RAND()<0.5,1,0)","v":0},0,1,1,0,0,0,1,0,1,0,1,1,1,1,0,0,0,0,1,null,null,4,0,null,9,0]
[1,0,1,1,0,1,0,0,1,1,0,0,0,0,0,1,0,1,0,0,null,null,6,1,null,8,0]
[1,1,1,0,1,0,0,1,1,1,1,0,1,1,0,0,0,1,1,0,null,null,7,1,null,12,1]
[0,0,0,1,0,1,0,0,1,1,1,1,1,1,0,1,0,1,0,1,null,null,{"$f":"SUM(A259:J259)","v":4},{"$f":"IF(W259>=6,1,0)","v":0},null,{"$f":"SUM(A259:T259)","v":11},{"$f":"IF(Z259>=12,1,0)","v":0}]
[1,1,1,1,0,0,1,0,1,1,0,0,1,1,1,0,0,0,0,0,null,null,7,1,null,10,0]
[1,1,1,1,1,1,0,0,0,1,1,1,1,0,1,0,0,1,0,0,null,null,7,1,null,12,1]
[0,1,1,1,0,0,0,1,1,0,0,1,0,1,1,1,0,0,0,0,null,null,5,0,null,9,0]
[1,0,0,1,0,0,0,1,0,1,0,1,0,1,1,0,1,1,0,1,null,null,4,0,null,10,0]
[0,1,1,0,1,0,0,0,1,0,1,0,0,1,1,0,1,0,0,0,null,null,4,0,null,8,0]
[0,0,1,1,0,0,0,1,0,0,1,1,0,0,1,1,1,0,0,1,null,null,3,0,null,9,0]
[0,1,1,0,0,0,0,0,0,1,1,1,0,1,1,1,0,1,0,0,null,null,3,0,null,9,0]
[0,1,1,1,1,0,1,0,0,0,0,0,1,1,0,1,0,0,1,1,null,null,5,0,null,10,0]
[0,1,1,1,1,0,1,1,1,1,0,0,1,1,1,0,1,1,1,1,null,null,8,1,null,15,1]
[0,0,1,0,0,0,0,0,1,0,1,0,0,1,0,1,1,0,0,1,null,null,2,0,null,7,0]
[1,1,1,1,0,0,1,1,1,1,1,1,0,1,0,1,0,1,1,0,null,null,8,1,null,14,1]
[0,1,1,1,1,1,0,0,1,0,1,0,1,1,0,{"$f":"IF(RAND()<0.5,1,0)","v":0},1,1,0,1,null,null,6,1,null,12,1]
[{"$f":"IF(RAND()<0.5,1,0)","v":0},1,1,1,1,1,1,1,1,0,1,1,1,0,1,0,0,1,1,1,null,null,8,1,null,15,1]
[0,0,0,0,0,1,0,1,0,0,0,1,1,0,0,1,0,0,1,0,null,null,2,0,null,6,0]
[0,1,1,0,1,1,0,1,1,0,0,0,1,0,0,0,1,0,0,1,null,null,6,1,null,9,0]
[1,0,0,1,0,1,0,0,1,1,0,1,0,0,1,0,0,0,0,0,null,null,5,0,null,7,0]
[1,0,0,0,0,0,1,1,0,0,1,1,1,1,1,0,1,1,1,0,null,null,3,0,null,11,0]
[0,1,1,0,0,0,0,1,1,1,0,0,1,0,0,0,1,1,1,0,null,null,5,0,null,9,0]
[1,0,0,1,1,0,1,0,0,1,0,1,1,0,1,0,1,1,1,1,null,null,5,0,null,12,1]
[0,0,0,1,0,0,0,0,1,0,0,1,0,1,0,1,1,1,1,1,null,null,2,0,null,9,0]
[0,0,0,0,1,1,1,0,0,0,1,1,1,1,1,0,0,1,1,0,null,null,3,0,null,10,0]
[1,0,0,1,0,0,1,0,0,1,1,1,0,1,0,0,0,1,0,1,null,null,4,0,null,9,0]
[1,0,1,1,1,0,0,0,1,0,0,0,1,1,1,1,0,0,0,0,null,null,5,0,null,9,0]
[1,0,0,0,0,0,1,0,1,1,0,0,0,0,1,1,1,0,1,0,null,null,4,0,null,8,0]
[1,1,1,0,0,1,1,0,0,1,1,1,0,0,0,0,1,1,0,0,null,null,6,1,null,10,0]
[0,0,1,0,0,1,0,0,0,1,1,0,0,0,0,1,0,1,1,0,null,null,3,0,null,7,0]
[0,0,1,1,0,1,0,1,0,0,1,1,1,1,0,1,0,0,1,1,null,null,4,0,null,11,0]
[0,0,0,1,0,0,1,1,0,0,1,0,0,0,0,{"$f":"IF(RAND()<0.5,1,0)","v":1},0,0,0,0,null,null,3,0,null,5,0]
[{"$f":"IF(RAND()<0.5,1,0)","v":1},1,0,1,1,1,1,0,0,0,1,0,1,0,0,1,0,0,1,0,null,null,6,1,null,10,0]
[1,1,0,1,0,1,0,0,0,1,1,0,0,0,1,1,0,0,0,1,null,null,5,0,null,9,0]
[1,0,0,1,1,1,1,1,0,0,1,0,1,0,0,1,1,1,1,1,null,null,6,1,null,13,1]
[0,1,1,1,0,1,1,0,1,0,0,1,0,0,0,0,1,0,0,1,null,null,6,1,null,9,0]
[1,1,0,1,0,1,1,1,1,0,1,0,0,0,1,0,1,0,0,0,null,null,7,1,null,10,0]
[1,1,0,1,0,0,0,0,0,0,0,0,1,1,1,0,0,1,0,0,null,null,3,0,null,7,0]
[0,0,0,1,0,1,1,1,1,0,0,1,1,1,0,1,0,1,0,0,null,null,5,0,null,10,0]
[1,0,0,0,0,1,1,1,1,0,1,1,1,1,0,0,0,0,1,0,null,null,5,0,null,10,0]
[0,0,0,0,1,0,1,1,1,0,1,1,0,0,1,1,1,1,0,1,null,null,4,0,null,11,0]
[0,0,0,0,0,0,1,0,1,1,1,1,1,1,0,0,1,0,1,1,null,null,3,0,null,10,0]
[0,0,1,1,1,0,1,0,1,1,0,0,1,1,1,0,1,1,0,0,null,null,6,1,null,11,0]
[1,1,0,0,0,1,0,1,1,0,1,0,1,1,0,1,0,1,1,0,null,null,5,0,null,11,0]
[0,1,1,0,1,0,1,0,0,1,0,0,0,1,1,0,0,1,0,0,null,null,5,0,null,8,0]
[0,1,0,1,1,1,1,0,0,0,0,1,0,0,0,0,0,0,1,1,null,null,5,0,null,8,0]
[1,1,0,0,1,1,0,1,1,0,1,0,1,1,0,1,1,0,1,1,null,null,6,1,null,13,1]
[0,1,0,0,1,1,1,1,1,1,0,0,1,0,1,{"$f":"IF(RAND()<0.5,1,0)","v":1},0,0,1,1,null,null,7,1,null,12,1]
[{"$f":"IF(RAND()<0.5,1,0)","v":1},1,1,1,0,0,1,1,1,1,0,0,1,1,1,0,1,1,1,1,null,null,8,1,null,15,1]
[1,0,1,0,1,0,1,1,0,1,0,1,1,0,1,1,1,1,0,1,null,null,6,1,null,13,1]
[1,1,1,1,0,0,0,1,0,0,1,1,0,0,1,1,0,1,0,0,null,null,5,0,null,10,0]
[1,0,1,1,1,1,1,1,0,1,0,0,0,0,0,1,0,1,0,0,null,null,8,1,null,10,0]
[0,0,0,0,0,0,0,0,1,0,1,1,1,1,1,1,0,1,1,0,null,null,1,0,null,9,0]
[0,0,1,0,0,1,0,1,0,1,1,1,1,0,1,0,1,1,0,0,null,null,4,0,null,10,0]
[1,1,1,0,1,0,0,1,0,1,1,1,1,1,0,1,1,1,1,1,null,null,6,1,null,15,1]
[1,1,1,0,0,0,0,0,0,1,1,1,0,0,1,0,1,1,1,1,null,null,4,0,null,11,0]
[0,0,0,0,0,0,0,1,0,1,1,0,0,0,0,0,0,1,1,1,null,null,2,0,null,6,0]
[1,1,1,1,0,1,1,0,1,0,1,1,1,1,0,1,0,0,1,0,null,null,7,1,null,13,1]
[1,1,0,0,0,1,0,0,1,0,0,0,1,1,1,0,1,1,1,0,null,null,4,0,null,10,0]
[0,1,1,0,1,0,0,1,0,0,0,1,1,0,1,0,0,1,1,0,null,null,4,0,null,9,0]
[1,1,0,0,1,1,1,0,1,1,0,1,1,0,1,1,1,0,0,1,null,null,7,1,null,13,1]
[1,1,0,1,0,1,1,1,1,0,0,1,1,1,0,1,1,1,1,1,null,null,7,1,null,15,1]
[0,0,1,0,0,0,0,1,1,0,1,1,0,0,0,0,0,1,1,0,null,null,3,0,null,7,0]
[0,1,0,1,0,0,0,0,1,1,1,0,1,1,1,{"$f":"IF(RAND()<0.5,1,0)","v":0},0,1,1,0,null,null,4,0,null,10,0]
[{"$f":"IF(RAND()<0.5,1,0)","v":1},1,1,1,0,1,1,0,0,0,0,0,1,1,0,1,0,0,0,1,null,null,6,1,null,10,0]
[0,0,0,1,1,0,0,0,1,0,1,1,1,1,0,0,0,1,0,0,null,null,3,0,null,8,0]
[1,0,1,1,0,0,0,1,1,0,1,0,1,1,0,1,0,1,0,0,null,null,5,0,null,10,0]
[0,0,0,0,1,0,0,1,0,0,0,1,0,1,1,0,0,0,1,1,null,null,{"$f":"SUM(A323:J323)","v":2},{"$f":"IF(W323>=6,1,0)","v":0},null,{"$f":"SUM(A323:T323)","v":7},{"$f":"IF(Z323>=12,1,0)","v":0}]
[0,0,0,0,1,1,1,1,0,0,0,0,0,1,1,1,0,0,1,0,null,null,4,0,null,8,0]
[1,0,1,1,1,0,1,1,1,1,1,1,1,1,0,0,1,0,0,1,null,null,8,1,null,14,1]
[0,1,0,1,0,0,0,0,1,1,1,0,0,1,0,1,1,0,0,0,null,null,4,0,null,8,0]
[0,1,0,1,0,0,1,0,0,1,0,0,0,0,1,0,0,1,0,0,null,null,4,0,null,6,0]
[1,1,1,0,0,1,1,0,0,1,1,1,1,1,1,1,0,1,0,0,null,null,6,1,null,13,1]
[0,0,0,0,0,0,0,0,0,1,0,0,1,0,0,0,1,0,0,0,null,null,1,0,null,3,0]
[0,0,0,1,1,1,0,0,1,1,0,1,0,0,1,0,0,1,1,0,null,null,5,0,null,9,0]
[1,0,1,1,0,1,0,1,1,0,1,1,1,1,1,1,0,1,0,1,null,null,6,1,null,14,1]
[1,0,0,0,0,1,1,1,1,0,0,1,0,0,1,1,0,1,0,1,null,null,5,0,null,10,0]
[0,1,1,0,0,0,0,0,1,0,1,1,1,0,1,0,1,0,0,0,null,null,3,0,null,8,0]
[0,1,1,0,0,1,0,1,0,1,0,1,1,0,1,1,1,1,1,0,null,null,5,0,null,12,1]
[0,1,0,0,1,1,0,0,0,1,1,0,1,1,0,{"$f":"IF(RAND()<0.5,1,0)","v":1},1,0,1,1,null,null,4,0,null,11,0]
[{"$f":"IF(RAND()<0.5,1,0)","v":1},1,0,0,0,0,0,1,0,0,1,1,0,0,1,1,0,0,0,1,null,null,3,0,null,8,0]
[0,0,0,1,0,0,1,0,0,1,0,0,1,1,0,0,0,1,0,1,null,null,3,0,null,7,0]
[0,0,0,0,1,1,1,1,0,0,1,0,0,1,0,0,1,0,0,1,null,null,4,0,null,8,0]
[1,1,0,1,0,1,1,1,0,1,0,1,0,1,1,0,1,0,1,1,null,null,7,1,null,13,1]
[1,0,1,0,1,0,0,0,0,0,0,0,1,0,0,0,0,1,1,0,null,null,3,0,null,6,0]
[0,1,1,0,1,0,0,1,0,1,1,1,1,0,0,1,1,1,0,1,null,null,5,0,null,12,1]
[1,0,0,0,1,0,0,1,1,0,0,1,1,0,1,0,1,1,0,0,null,null,4,0,null,9,0]
[0,0,0,0,0,0,0,1,1,0,1,0,1,1,1,1,1,1,0,1,null,null,2,0,null,10,0]
[1,1,1,0,1,1,0,0,0,0,0,0,0,1,0,0,1,1,1,1,null,null,5,0,null,10,0]
[1,1,1,0,1,1,0,0,1,1,1,1,0,1,1,1,0,0,0,0,null,null,7,1,null,12,1]
[0,0,1,1,1,1,1,0,1,1,1,1,0,0,0,1,1,1,0,0,null,null,7,1,null,12,1]
[0,1,1,0,0,1,0,0,0,0,0,0,0,0,0,0,0,0,0,0,null,null,3,0,null,3,0]
[0,0,0,1,0,0,1,0,1,0,0,0,1,1,1,1,1,1,1,0,null,null,3,0,null,10,0]
[1,1,1,1,1,0,1,0,0,0,1,1,1,1,1,0,0,1,0,1,null,null,6,1,null,13,1]
[0,0,1,0,0,0,1,1,1,1,0,1,1,1,1,1,1,1,0,0,null,null,5,0,null,12,1]
[1,1,0,1,1,1,1,1,1,0,1,1,1,0,1,{"$f":"IF(RAND()<0.5,1,0)","v":1},0,0,1,0,null,null,8,1,null,14,1]
[{"$f":"IF(RAND()<0.5,1,0)","v":0},0,0,0,0,0,1,1,1,1,0,1,0,0,0,0,0,0,1,0,null,null,4,0,null,6,0]
[0,1,1,0,0,1,1,1,0,1,1,0,0,1,1,1,0,1,1,0,null,null,6,1,null,12,1]
[1,1,0,0,0,1,0,1,1,0,0,0,0,1,0,1,1,0,1,1,null,null,5,0,null,10,0]
[1,0,0,0,0,1,0,1,1,0,0,0,1,0,0,0,1,0,1,0,null,null,4,0,null,7,0]
[1,0,0,0,0,0,0,0,1,0,1,0,0,1,1,0,0,1,1,1,null,null,2,0,null,8,0]
[1,1,0,0,1,0,1,1,0,0,0,0,0,0,0,1,0,1,1,0,null,null,5,0,null,8,0]
[1,0,0,1,0,0,0,0,0,1,0,0,1,0,1,0,0,0,1,1,null,null,3,0,null,7,0]
[0,0,0,0,1,0,1,1,1,1,1,0,1,0,0,1,1,0,0,1,null,null,5,0,null,10,0]
[0,0,0,0,1,0,0,0,0,0,1,1,0,0,0,1,0,1,0,1,null,null,1,0,null,6,0]
[0,0,1,1,0,0,1,0,0,0,1,0,0,0,0,1,1,1,1,1,null,null,3,0,null,9,0]
[1,1,0,0,0,1,1,1,0,1,0,0,0,0,1,1,1,1,0,0,null,null,6,1,null,10,0]
[0,1,1,0,0,1,1,0,1,1,1,0,1,0,0,0,0,1,1,0,null,null,6,1,null,10,0]
[1,1,1,1,1,1,0,1,1,1,1,0,0,1,1,0,0,0,1,0,null,null,9,1,null,13,1]
[0,0,1,0,0,1,1,1,0,1,0,0,1,0,1,1,0,0,1,0,null,null,5,0,null,9,0]
[1,1,0,0,1,1,1,1,1,0,1,1,1,1,0,1,0,1,0,0,null,null,7,1,null,13,1]
[0,0,1,0,1,1,1,1,1,0,0,0,1,1,1,{"$f":"IF(RAND()<0.5,1,0)","v":1},0,1,0,1,null,null,6,1,null,12,1]
[{"$f":"IF(RAND()<0.5,1,0)","v":1},0,1,1,0,1,1,1,1,0,1,1,0,0,0,0,1,1,1,0,null,null,7,1,null,12,1]
[0,1,0,0,0,0,1,0,1,1,1,1,1,0,1,1,0,0,1,0,null,null,4,0,null,10,0]
[1,0,1,1,0,1,0,0,0,1,1,1,1,1,1,1,0,1,1,1,null,null,5,0,null,14,1]
[0,0,1,0,1,0,1,0,1,1,0,0,0,1,1,0,0,1,1,1,null,null,5,0,null,10,0]
[0,1,0,1,1,0,0,1,1,0,1,1,0,0,0,1,1,1,1,1,null,null,5,0,null,12,1]
[0,1,1,1,0,0,0,1,0,0,0,0,0,1,1,1,1,0,1,0,null,null,4,0,null,9,0]
[0,0,1,1,0,0,1,0,1,1,0,1,0,0,0,0,0,0,1,1,null,null,5,0,null,8,0]
[1,1,0,0,0,1,1,0,1,0,0,0,1,1,1,1,0,1,1,1,null,null,5,0,null,12,1]
[1,0,0,0,1,0,0,0,0,0,1,1,0,1,1,0,1,0,0,1,null,null,2,0,null,8,0]
[1,0,1,1,0,0,0,1,0,1,0,1,0,0,0,0,0,1,1,0,null,null,5,0,null,8,0]
[0,0,1,1,0,0,0,1,0,0,1,1,1,1,1,0,1,1,0,1,null,null,3,0,null,11,0]
[1,0,0,0,0,0,1,0,1,0,1,0,1,1,0,1,0,0,0,0,null,null,3,0,null,7,0]
[1,1,0,1,1,1,1,1,0,0,0,0,0,1,0,1,1,0,1,0,null,null,7,1,null,11,0]
[1,1,0,1,0,0,1,1,0,0,1,0,0,0,0,0,0,0,1,1,null,null,5,0,null,8,0]
[0,0,1,0,0,1,1,1,1,0,1,0,0,1,1,0,1,1,1,1,null,null,5,0,null,12,1]
[0,0,1,0,0,1,1,0,1,1,0,1,1,0,0,{"$f":"IF(RAND()<0.5,1,0)","v":0},1,0,0,1,null,null,5,0,null,9,0]
[{"$f":"IF(RAND()<0.5,1,0)","v":0},1,0,1,0,0,1,0,0,1,1,0,0,1,0,1,1,1,0,0,null,null,4,0,null,9,0]
[0,1,1,0,0,0,1,0,0,0,0,0,0,1,0,1,1,1,0,0,null,null,3,0,null,7,0]
[1,0,0,1,1,0,0,0,0,1,1,0,0,0,1,0,1,1,1,1,null,null,4,0,null,10,0]
[1,1,0,0,1,1,0,1,1,1,1,0,1,1,1,0,0,1,0,1,null,null,{"$f":"SUM(A387:J387)","v":7},{"$f":"IF(W387>=6,1,0)","v":1},null,{"$f":"SUM(A387:T387)","v":13},{"$f":"IF(Z387>=12,1,0)","v":1}]
[0,0,0,1,0,0,1,1,1,1,0,1,1,0,1,1,0,1,1,1,null,null,5,0,null,12,1]
[0,1,0,0,0,1,1,1,0,0,1,0,1,1,1,0,0,1,0,0,null,null,4,0,null,9,0]
[0,1,0,0,1,1,1,1,1,0,0,0,0,1,0,1,0,0,1,0,null,null,6,1,null,9,0]
[1,0,1,0,0,1,0,0,0,1,1,1,1,1,0,0,0,0,1,1,null,null,4,0,null,10,0]
[0,1,0,0,1,0,0,1,0,0,0,1,1,1,1,1,0,0,0,0,null,null,3,0,null,8,0]
[1,0,1,0,1,1,1,0,1,1,0,1,0,1,1,0,0,1,0,0,null,null,7,1,null,11,0]
[0,1,1,1,0,1,0,0,0,1,0,1,1,0,1,0,1,1,0,0,null,null,5,0,null,10,0]
[1,1,1,0,0,1,0,0,1,1,0,0,1,0,1,1,1,1,1,0,null,null,6,1,null,12,1]
[0,1,1,0,1,0,0,1,0,1,0,0,0,1,0,0,0,1,1,0,null,null,5,0,null,8,0]
[0,1,1,0,0,1,0,1,0,1,1,1,0,0,1,0,1,1,0,1,null,null,5,0,null,11,0]
[1,0,0,0,1,0,1,0,1,0,1,1,0,1,0,1,1,1,0,1,null,null,4,0,null,11,0]
[1,1,0,1,0,1,1,0,0,1,0,0,1,0,1,{"$f":"IF(RAND()<0.5,1,0)","v":0},1,0,1,1,null,null,6,1,null,11,0]
[{"$f":"IF(RAND()<0.5,1,0)","v":0},0,0,1,1,1,0,0,1,1,1,0,0,0,1,0,0,0,0,0,null,null,5,0,null,7,0]
[1,0,0,1,0,0,1,1,0,1,1,1,1,0,0,0,1,0,1,0,null,null,5,0,null,10,0]
[1,1,1,0,1,0,0,0,1,1,0,1,1,0,1,1,0,0,1,0,null,null,6,1,null,11,0]
[1,0,0,1,0,1,1,1,0,1,0,0,0,1,1,1,1,1,0,1,null,null,6,1,null,12,1]
[0,1,1,0,1,0,0,0,1,1,0,0,0,0,0,1,1,1,0,0,null,null,5,0,null,8,0]
[1,1,1,0,0,0,0,1,1,0,1,1,1,1,1,1,0,1,1,1,null,null,5,0,null,14,1]
[1,0,1,0,1,1,1,0,1,1,0,0,0,1,1,1,0,1,1,1,null,null,7,1,null,13,1]
[0,0,1,1,1,1,0,0,0,0,1,0,0,0,0,0,1,1,0,1,null,null,4,0,null,8,0]
[0,1,1,1,0,0,1,0,1,1,1,0,0,0,0,1,0,0,0,1,null,null,6,1,null,9,0]
[1,1,0,1,1,1,0,1,1,0,0,1,1,1,0,0,1,1,0,0,null,null,7,1,null,12,1]
[1,0,1,0,0,1,1,0,1,0,0,1,0,0,0,1,0,1,0,1,null,null,5,0,null,9,0]
[1,0,1,0,0,0,1,0,1,0,1,0,0,0,0,0,0,1,0,0,null,null,4,0,null,6,0]
[0,1,1,1,0,1,0,0,0,0,0,1,1,1,1,1,1,1,0,1,null,null,4,0,null,12,1]
[1,1,1,0,0,0,1,0,1,0,1,1,0,1,0,0,1,0,0,0,null,null,5,0,null,9,0]
[1,1,1,0,0,0,1,0,0,0,0,0,0,0,1,1,0,0,0,1,null,null,4,0,null,7,0]
[0,0,0,1,0,0,0,1,1,1,1,1,0,1,1,{"$f":"IF(RAND()<0.5,1,0)","v":1},1,0,1,0,null,null,4,0,null,11,0]
[{"$f":"IF(RAND()<0.5,1,0)","v":0},1,0,0,0,0,0,0,0,1,1,0,0,0,1,1,1,0,0,1,null,null,2,0,null,7,0]
[1,1,1,0,1,0,1,0,0,1,0,0,1,0,0,1,0,1,0,1,null,null,6,1,null,10,0]
[1,0,1,0,1,0,0,1,1,0,1,1,0,1,0,0,0,1,1,1,null,null,5,0,null,11,0]
[0,0,1,1,0,0,1,0,0,0,1,1,0,0,0,0,1,0,0,0,null,null,3,0,null,6,0]
[1,1,0,0,1,1,1,1,1,0,1,0,1,1,1,1,0,0,1,0,null,null,7,1,null,13,1]
[1,0,1,0,1,0,1,1,1,0,1,0,1,0,0,1,1,1,0,0,null,null,6,1,null,11,0]
[1,1,0,0,1,1,0,1,0,1,0,0,1,1,0,1,0,0,1,1,null,null,6,1,null,11,0]
[1,0,0,1,0,1,0,1,1,1,0,1,1,0,0,1,1,0,1,1,null,null,6,1,null,12,1]
[1,1,1,1,1,1,1,0,1,0,0,0,0,0,1,1,0,1,1,1,null,null,8,1,null,13,1]
[0,1,0,1,1,0,0,0,1,1,0,1,0,0,1,1,0,0,1,1,null,null,5,0,null,10,0]
[0,0,0,0,0,0,0,0,0,0,1,0,0,1,1,1,1,0,1,0,null,null,0,0,null,6,0]
[0,0,0,0,1,0,1,0,1,0,1,1,0,0,1,0,0,0,1,1,null,null,3,0,null,8,0]
[0,0,1,1,0,0,1,0,0,0,0,0,1,0,1,1,1,0,0,1,null,null,3,0,null,8,0]
[1,0,1,1,0,1,0,1,1,0,1,0,1,0,0,0,1,1,1,0,null,null,6,1,null,11,0]
[1,1,1,0,0,0,1,0,1,1,0,1,1,1,0,0,1,1,1,1,null,null,6,1,null,13,1]
[0,0,1,0,1,0,0,1,0,0,0,0,1,0,0,{"$f":"IF(RAND()<0.5,1,0)","v":0},1,0,0,0,null,null,3,0,null,5,0]
[{"$f":"IF(RAND()<0.5,1,0)","v":1},0,1,0,1,1,0,0,1,0,1,1,0,1,1,1,0,0,0,0,null,null,5,0,null,10,0]
[1,1,0,1,0,0,1,1,1,1,0,0,0,0,1,1,0,1,1,0,null,null,7,1,null,11,0]
[1,0,1,0,1,0,1,1,1,1,1,1,1,1,0,1,0,1,1,1,null,null,7,1,null,15,1]
[1,0,1,0,1,1,0,0,1,1,1,0,1,0,1,1,0,0,0,0,null,null,6,1,null,10,0]
[1,0,1,0,0,0,1,0,0,1,1,0,1,0,1,0,0,0,0,1,null,null,4,0,null,8,0]
[1,0,0,0,1,1,0,0,1,0,0,0,0,1,1,1,0,1,1,0,null,null,4,0,null,9,0]
[1,0,1,0,0,1,0,1,1,0,0,1,0,1,1,0,0,0,1,1,null,null,5,0,null,10,0]
[1,1,1,0,1,1,1,1,1,1,0,0,1,0,0,0,1,0,0,1,null,null,9,1,null,12,1]
[1,1,1,1,0,1,0,1,0,1,0,0,0,0,1,1,0,1,1,0,null,null,7,1,null,11,0]
[0,0,0,0,1,0,0,0,0,1,0,1,0,0,1,0,1,0,1,1,null,null,2,0,null,7,0]
[0,1,0,1,1,1,1,1,0,0,0,0,0,0,1,1,1,0,0,0,null,null,6,1,null,9,0]
[0,0,0,0,0,0,0,0,0,0,1,0,1,1,1,0,1,0,0,0,null,null,0,0,null,5,0]
[1,1,0,1,1,0,1,0,0,1,1,0,1,1,0,0,0,1,1,1,null,null,6,1,null,12,1]
[1,1,0,0,1,0,1,0,0,1,1,0,1,1,0,1,1,0,0,0,null,null,5,0,null,10,0]
[0,1,0,1,1,1,0,0,1,1,1,1,0,0,1,1,0,1,0,0,null,null,6,1,null,11,0]
[0,1,1,0,1,0,0,1,0,1,1,1,0,1,0,{"$f":"IF(RAND()<0.5,1,0)","v":1},1,0,1,1,null,null,5,0,null,12,1]
[{"$f":"IF(RAND()<0.5,1,0)","v":1},0,1,1,0,0,0,1,0,0,0,0,0,1,0,1,0,1,1,0,null,null,4,0,null,8,0]
[1,1,0,1,1,0,0,0,1,1,1,1,1,0,1,0,0,0,0,0,null,null,6,1,null,10,0]
[1,1,0,0,1,0,0,0,1,1,1,1,1,0,0,1,1,0,1,0,null,null,5,0,null,11,0]
[1,1,0,1,0,1,1,0,0,1,1,1,1,1,0,1,1,1,1,1,null,null,{"$f":"SUM(A451:J451)","v":6},{"$f":"IF(W451>=6,1,0)","v":1},null,{"$f":"SUM(A451:T451)","v":15},{"$f":"IF(Z451>=12,1,0)","v":1}]
[0,0,1,1,0,0,0,0,0,1,1,0,1,0,1,0,1,0,0,0,null,null,3,0,null,7,0]
[1,0,1,1,0,1,0,0,0,0,1,0,0,0,0,0,0,0,0,0,null,null,4,0,null,5,0]
[1,0,1,0,0,1,0,0,0,0,1,0,1,1,1,0,0,0,1,1,null,null,3,0,null,9,0]
[1,1,0,1,0,1,0,0,1,1,0,0,1,1,1,0,0,0,0,0,null,null,6,1,null,9,0]
[0,1,0,0,0,1,1,1,0,0,0,0,0,0,0,1,0,1,0,1,null,null,4,0,null,7,0]
[0,0,1,1,0,0,0,0,0,0,1,0,0,0,1,1,0,0,1,1,null,null,2,0,null,7,0]
[1,1,0,1,0,1,1,0,1,0,0,1,1,1,1,1,1,0,1,1,null,null,6,1,null,14,1]
[0,0,1,1,1,0,1,1,1,1,1,1,0,0,1,1,0,0,0,1,null,null,7,1,null,12,1]
[1,1,1,0,0,0,0,0,1,1,1,1,1,0,0,0,0,0,1,1,null,null,5,0,null,10,0]
[0,1,1,0,0,0,0,0,0,1,0,0,0,0,0,1,0,0,1,1,null,null,3,0,null,6,0]
[0,1,0,1,1,0,0,1,1,0,1,1,0,1,0,0,0,1,0,1,null,null,5,0,null,10,0]
[1,0,0,0,0,1,0,1,0,1,0,1,0,1,1,{"$f":"IF(RAND()<0.5,1,0)","v":1},0,1,0,0,null,null,4,0,null,9,0]
[{"$f":"IF(RAND()<0.5,1,0)","v":1},0,1,0,1,0,0,1,1,1,0,1,1,0,1,0,1,0,0,0,null,null,6,1,null,10,0]
[1,0,0,1,1,1,0,0,1,1,1,0,1,1,0,0,0,0,1,1,null,null,6,1,null,11,0]
[0,1,0,1,0,0,0,1,1,1,1,0,1,0,0,0,0,1,1,0,null,null,5,0,null,9,0]
[1,1,0,0,0,1,0,1,0,1,1,0,0,0,0,0,0,1,0,1,null,null,5,0,null,8,0]
[1,0,1,0,0,1,0,1,1,0,0,1,0,1,0,0,0,1,0,0,null,null,5,0,null,8,0]
[1,0,0,0,1,0,0,0,0,1,0,0,1,0,1,1,1,0,1,1,null,null,3,0,null,9,0]
[1,0,1,1,0,0,1,1,1,0,0,0,0,1,1,1,1,0,1,1,null,null,6,1,null,12,1]
[1,1,0,0,1,0,0,1,0,1,0,1,0,1,1,1,0,1,0,0,null,null,5,0,null,10,0]
[0,1,0,0,1,1,1,1,0,1,0,0,0,1,1,0,1,0,1,0,null,null,6,1,null,10,0]
[1,1,1,1,1,0,1,1,1,1,1,1,1,0,1,1,0,1,0,1,null,null,9,1,null,16,1]
[1,1,0,0,0,0,0,0,0,0,1,1,0,1,0,0,1,1,0,0,null,null,2,0,null,7,0]
[1,0,1,1,0,1,1,0,1,1,0,0,1,0,0,0,1,1,1,1,null,null,7,1,null,12,1]
[0,1,1,1,1,1,1,1,1,0,0,0,1,1,1,0,0,1,1,1,null,null,8,1,null,14,1]
[0,0,1,1,1,1,0,0,1,0,1,0,0,0,0,1,0,0,0,1,null,null,5,0,null,8,0]
[0,0,1,0,1,1,1,0,1,0,0,1,0,1,0,0,1,1,1,1,null,null,5,0,null,11,0]
[0,1,0,0,0,0,0,0,0,1,1,1,1,0,0,{"$f":"IF(RAND()<0.5,1,0)","v":1},1,0,1,1,null,null,2,0,null,9,0]
[{"$f":"IF(RAND()<0.5,1,0)","v":0},1,0,1,1,1,1,1,1,0,0,0,0,0,1,0,1,0,0,0,null,null,7,1,null,9,0]
[0,1,1,0,0,1,0,1,0,1,0,1,1,0,0,0,0,0,0,0,null,null,5,0,null,7,0]
[1,0,1,0,1,0,1,1,0,0,0,0,0,1,1,1,1,0,0,1,null,null,5,0,null,10,0]
[1,0,0,0,1,1,0,0,1,0,0,0,0,0,0,0,0,1,1,0,null,null,4,0,null,6,0]
[1,0,0,1,1,0,1,1,1,0,0,1,1,1,0,1,1,0,1,1,null,null,6,1,null,13,1]
[1,0,0,1,1,0,0,1,0,1,1,0,0,1,0,1,1,1,1,1,null,null,5,0,null,12,1]
[1,1,1,1,1,1,0,0,1,1,1,0,0,1,0,0,0,0,1,0,null,null,8,1,null,11,0]
[1,1,1,0,1,1,1,0,0,1,0,0,1,0,0,1,0,0,1,0,null,null,7,1,null,10,0]
[1,1,0,1,1,1,0,1,0,0,0,1,1,1,1,0,0,1,0,0,null,null,6,1,null,11,0]
[0,0,1,1,0,1,1,1,0,1,0,1,1,1,0,1,1,1,0,0,null,null,6,1,null,12,1]
[0,1,1,0,1,1,1,0,0,1,0,1,0,0,1,1,1,0,1,1,null,null,6,1,null,12,1]
[0,1,1,0,1,0,1,0,0,1,0,0,0,1,1,1,1,0,0,1,null,null,5,0,null,10,0]
[1,1,1,1,0,1,0,0,0,0,1,1,0,0,1,0,1,0,0,0,null,null,5,0,null,9,0]
[0,0,1,1,1,0,0,1,0,1,1,0,1,1,0,0,1,1,0,0,null,null,5,0,null,10,0]
[0,1,1,0,0,1,0,1,0,0,1,0,1,0,0,0,1,1,0,0,null,null,4,0,null,8,0]
[0,1,0,1,1,1,1,0,1,1,0,0,1,0,0,{"$f":"IF(RAND()<0.5,1,0)","v":1},0,1,1,1,null,null,7,1,null,12,1]
[{"$f":"IF(RAND()<0.5,1,0)","v":1},1,0,1,0,0,1,1,1,1,0,0,1,0,0,1,1,0,1,0,null,null,7,1,null,11,0]
[0,0,1,0,0,1,0,0,0,1,1,0,0,0,1,0,0,1,1,1,null,null,3,0,null,8,0]
[0,0,1,1,0,1,0,0,0,0,1,0,0,0,0,0,0,0,0,0,null,null,3,0,null,4,0]
[0,0,1,1,0,0,0,1,0,0,0,1,0,1,0,0,1,1,1,0,null,null,3,0,null,8,0]
[1,1,0,1,0,0,1,0,1,0,0,0,1,0,0,1,0,0,1,0,null,null,5,0,null,8,0]
[0,0,0,1,0,0,1,1,0,0,0,1,1,0,1,0,1,1,0,1,null,null,3,0,null,9,0]
[1,0,1,0,1,1,1,1,0,0,0,0,0,1,1,1,1,1,0,1,null,null,6,1,null,12,1]
[0,0,1,0,0,0,0,1,1,0,0,0,1,1,0,0,0,1,0,1,null,null,3,0,null,7,0]
[1,0,1,1,1,1,0,0,1,0,0,1,1,1,1,1,1,0,1,0,null,null,6,1,null,13,1]
[0,1,0,1,0,0,0,1,0,1,1,1,0,0,1,0,0,1,0,0,null,null,4,0,null,8,0]
[0,0,1,0,1,1,0,1,1,1,0,1,0,0,0,1,0,0,1,0,null,null,6,1,null,9,0]
[1,1,0,1,0,0,1,1,1,1,0,1,0,1,1,1,1,0,0,1,null,null,7,1,null,13,1]
[1,1,1,0,0,0,0,0,1,1,0,0,0,0,0,1,0,1,0,0,null,null,5,0,null,7,0]
[1,1,1,1,1,0,0,1,0,0,0,0,0,0,1,1,1,1,1,0,null,null,6,1,null,11,0]
[1,1,1,0,1,1,0,1,0,1,0,0,1,1,1,0,1,0,0,0,null,null,7,1,null,11,0]
[0,1,1,1,0,0,1,0,1,1,1,0,0,0,0,{"$f":"IF(RAND()<0.5,1,0)","v":0},1,0,1,1,null,null,6,1,null,10,0]
[{"$f":"IF(RAND()<0.5,1,0)","v":1},0,1,1,1,1,1,0,0,0,0,0,0,1,0,0,1,0,1,0,null,null,6,1,null,9,0]
[1,0,0,0,0,0,0,1,0,1,0,0,1,1,1,1,1,1,0,1,null,null,3,0,null,10,0]
[1,1,1,1,1,0,0,0,1,0,0,1,1,0,1,0,1,0,0,1,null,null,6,1,null,11,0]
[1,1,0,1,1,0,0,1,1,1,0,1,1,1,1,1,0,0,1,0,null,null,{"$f":"SUM(A515:J515)","v":7},{"$f":"IF(W515>=6,1,0)","v":1},null,{"$f":"SUM(A515:T515)","v":13},{"$f":"IF(Z515>=12,1,0)","v":1}]
[0,1,1,1,1,0,0,0,1,0,0,0,0,1,1,1,0,1,0,0,null,null,5,0,null,9,0]
[0,1,0,0,0,0,0,1,0,0,0,1,0,0,0,1,1,0,1,1,null,null,2,0,null,7,0]
[0,1,0,0,1,0,0,1,1,1,0,0,1,1,1,1,0,0,1,0,null,null,5,0,null,10,0]
[1,1,1,0,1,0,1,0,1,1,0,0,0,1,1,1,1,0,1,1,null,null,7,1,null,13,1]
[1,1,0,1,0,1,1,0,1,0,0,0,1,0,0,1,0,0,0,0,null,null,6,1,null,8,0]
[1,1,0,1,0,1,1,1,1,0,1,1,1,1,0,0,1,1,0,0,null,null,7,1,null,13,1]
[1,0,1,1,1,1,1,0,0,1,0,1,0,0,0,1,0,1,0,0,null,null,7,1,null,10,0]
[1,0,0,1,1,1,1,0,0,1,0,1,1,1,1,1,0,0,0,1,null,null,6,1,null,12,1]
[1,1,0,1,1,1,1,1,1,1,1,0,0,1,0,1,1,1,1,1,null,null,9,1,null,16,1]
[1,0,0,1,0,1,1,0,0,1,0,1,0,0,0,1,1,0,1,0,null,null,5,0,null,9,0]
[1,1,0,1,1,0,1,0,1,1,0,0,0,0,1,1,0,1,1,1,null,null,7,1,null,12,1]
[0,1,1,1,1,1,1,1,0,0,1,0,1,0,0,{"$f":"IF(RAND()<0.5,1,0)","v":0},1,0,0,1,null,null,7,1,null,11,0]
[{"$f":"IF(RAND()<0.5,1,0)","v":1},1,1,1,1,1,0,0,0,0,1,1,0,0,0,0,0,0,0,1,null,null,6,1,null,9,0]
[0,0,0,0,0,0,0,0,0,1,0,1,0,0,0,0,1,0,1,0,null,null,1,0,null,4,0]
[0,0,0,0,1,0,0,0,1,0,0,0,1,0,1,0,0,0,1,1,null,null,2,0,null,6,0]
[1,0,1,0,1,1,0,0,0,1,0,0,0,1,1,0,1,0,0,0,null,null,5,0,null,8,0]
[0,0,0,0,0,1,0,0,0,1,1,0,0,1,0,0,0,1,0,1,null,null,2,0,null,6,0]
[1,0,1,0,0,1,0,0,0,1,0,1,0,0,0,1,0,0,0,0,null,null,4,0,null,6,0]
[1,1,0,1,0,0,1,0,0,0,0,0,1,0,1,1,0,0,1,1,null,null,4,0,null,9,0]
[1,1,0,1,1,0,0,0,1,0,1,1,1,0,0,1,0,0,0,1,null,null,5,0,null,10,0]
[1,1,1,0,1,1,0,1,1,1,0,0,0,1,1,1,1,1,0,1,null,null,8,1,null,14,1]
[0,1,0,1,1,0,1,1,1,1,0,0,1,0,0,0,1,1,1,1,null,null,7,1,null,12,1]
[1,1,1,1,0,1,1,1,0,0,1,1,1,1,1,0,0,1,0,0,null,null,7,1,null,13,1]
[1,1,1,0,0,0,1,0,0,1,1,0,0,0,0,1,1,1,1,0,null,null,5,0,null,10,0]
[1,0,1,1,1,0,0,0,1,0,0,1,1,1,1,0,0,1,1,0,null,null,5,0,null,11,0]
[1,0,0,1,0,1,1,0,0,1,0,1,0,0,1,1,1,1,0,0,null,null,5,0,null,10,0]
[0,1,0,1,1,0,0,1,1,0,0,1,0,0,0,0,1,1,0,1,null,null,5,0,null,9,0]
[0,0,1,1,1,1,1,1,0,1,0,1,0,0,1,{"$f":"IF(RAND()<0.5,1,0)","v":0},0,1,0,1,null,null,7,1,null,11,0]
[{"$f":"IF(RAND()<0.5,1,0)","v":1},0,1,1,1,1,0,0,0,1,1,1,0,1,0,0,0,0,0,1,null,null,6,1,null,10,0]
[0,0,0,0,0,1,1,0,1,0,0,1,1,1,0,0,1,1,0,1,null,null,3,0,null,9,0]
[1,1,1,0,1,0,1,0,0,0,0,0,1,1,1,1,1,0,0,0,null,null,5,0,null,10,0]
[0,0,1,1,0,0,1,0,1,1,0,0,0,0,0,0,1,0,0,0,null,null,5,0,null,6,0]
[1,0,1,1,1,0,1,0,1,1,1,0,0,0,1,0,0,1,1,1,null,null,7,1,null,12,1]
[1,1,1,0,1,0,1,0,0,1,0,1,0,0,1,0,0,1,1,0,null,null,6,1,null,10,0]
[1,1,0,1,0,0,0,1,1,1,1,1,0,1,1,1,0,0,0,1,null,null,6,1,null,12,1]
[1,1,1,0,1,1,0,0,0,0,1,1,1,1,0,0,1,1,0,1,null,null,5,0,null,12,1]
[1,0,1,0,1,0,0,0,0,0,0,0,1,1,0,0,1,1,0,0,null,null,3,0,null,7,0]
[0,0,0,1,0,0,1,1,0,0,1,1,0,0,0,1,0,1,0,1,null,null,3,0,null,8,0]
[0,0,0,1,1,1,1,1,1,1,1,0,1,1,1,1,0,1,0,0,null,null,7,1,null,13,1]
[1,0,0,0,1,1,0,1,0,0,0,0,0,1,1,0,1,1,1,0,null,null,4,0,null,9,0]
[1,0,1,1,0,0,0,0,0,0,0,0,0,1,1,1,1,1,0,1,null,null,3,0,null,9,0]
[0,0,0,1,0,0,1,0,1,0,0,1,1,1,0,1,1,0,0,0,null,null,3,0,null,8,0]
[1,1,0,0,1,0,0,0,1,1,0,0,1,0,0,0,1,1,1,1,null,null,5,0,null,10,0]
[0,0,0,1,1,0,0,1,1,0,0,0,0,1,0,{"$f":"IF(RAND()<0.5,1,0)","v":0},0,0,1,0,null,null,4,0,null,6,0]
[{"$f":"IF(RAND()<0.5,1,0)","v":0},1,1,0,0,0,1,0,1,1,0,1,0,1,0,0,0,1,0,0,null,null,5,0,null,8,0]
[0,1,0,1,0,0,1,0,0,1,1,0,0,0,0,0,0,0,0,0,null,null,4,0,null,5,0]
[1,0,0,0,0,1,1,0,0,1,1,0,0,1,0,0,0,0,0,0,null,null,4,0,null,6,0]
[0,1,1,0,1,0,1,0,0,0,0,0,0,1,0,0,1,1,0,0,null,null,4,0,null,7,0]
[0,1,0,0,0,1,1,0,0,0,0,0,1,1,1,0,0,0,0,1,null,null,3,0,null,7,0]
[0,0,0,0,0,0,1,0,0,0,1,0,1,1,1,1,0,1,1,0,null,null,1,0,null,8,0]
[0,0,1,1,0,1,1,1,1,0,0,1,1,0,1,1,0,0,0,0,null,null,6,1,null,10,0]
[0,0,1,1,0,1,0,1,1,0,1,0,1,1,1,1,0,0,0,0,null,null,5,0,null,10,0]
[0,1,1,1,0,1,1,1,1,1,0,0,1,0,0,0,1,0,1,0,null,null,8,1,null,11,0]
[1,1,0,0,1,1,0,1,1,0,1,1,0,0,1,0,0,0,1,0,null,null,6,1,null,10,0]
[0,0,1,1,1,1,1,1,1,1,0,1,0,1,0,0,1,1,1,0,null,null,8,1,null,13,1]
[1,0,0,1,1,1,0,1,0,0,1,1,0,1,1,0,1,1,0,1,null,null,5,0,null,12,1]
[0,1,1,1,0,0,1,0,0,1,0,0,0,1,0,0,0,1,0,0,null,null,5,0,null,7,0]
[0,1,0,0,0,1,0,1,1,1,0,1,1,1,1,0,0,1,0,1,null,null,5,0,null,11,0]
[1,1,1,0,0,0,1,1,1,0,0,1,1,1,0,1,1,0,0,0,null,null,6,1,null,11,0]
[1,0,1,1,0,0,0,1,1,1,1,1,1,0,1,{"$f":"IF(RAND()<0.5,1,0)","v":1},1,1,1,1,null,null,6,1,null,15,1]
[{"$f":"IF(RAND()<0.5,1,0)","v":1},1,1,1,0,1,0,0,0,0,1,1,1,0,1,1,0,1,0,1,null,null,5,0,null,12,1]
[1,1,1,1,1,1,0,1,0,1,1,1,1,0,1,1,1,0,0,1,null,null,8,1,null,15,1]
[0,0,1,0,1,0,1,1,0,0,0,0,0,1,1,0,1,0,1,0,null,null,4,0,null,8,0]
[1,1,0,0,0,0,0,1,1,1,0,0,0,0,1,0,0,1,0,0,null,null,{"$f":"SUM(A579:J579)","v":5},{"$f":"IF(W579>=6,1,0)","v":0},null,{"$f":"SUM(A579:T579)","v":7},{"$f":"IF(Z579>=12,1,0)","v":0}]
[1,0,1,1,1,0,0,1,1,1,1,0,1,1,1,0,1,0,1,0,null,null,7,1,null,13,1]
[0,1,1,0,0,1,1,0,1,0,0,1,1,0,1,1,0,0,0,0,null,null,5,0,null,9,0]
[0,1,1,0,0,0,1,1,1,1,0,0,1,1,0,0,1,0,0,1,null,null,6,1,null,10,0]
[0,0,1,1,0,0,0,0,0,0,0,0,0,1,0,0,1,0,1,1,null,null,2,0,null,6,0]
[0,1,0,0,0,1,0,1,0,0,0,1,0,1,1,1,1,1,1,0,null,null,3,0,null,10,0]
[1,1,1,0,0,1,0,1,1,1,1,0,0,1,1,1,1,0,1,0,null,null,7,1,null,13,1]
[0,0,1,0,1,1,0,1,0,1,0,1,0,1,0,0,0,1,0,0,null,null,5,0,null,8,0]
[1,0,1,1,1,1,1,0,1,1,0,0,0,1,1,1,1,1,1,1,null,null,8,1,null,15,1]
[0,1,1,0,1,0,0,0,0,0,1,0,0,0,1,0,0,0,1,1,null,null,3,0,null,7,0]
[1,1,1,1,1,0,0,1,0,0,1,0,1,1,1,0,1,0,1,1,null,null,6,1,null,13,1]
[1,1,1,0,1,1,1,1,0,0,1,1,1,1,1,1,1,0,1,1,null,null,7,1,null,16,1]
[0,0,0,0,0,0,0,0,0,1,0,0,0,0,0,{"$f":"IF(RAND()<0.5,1,0)","v":1},1,1,1,1,null,null,1,0,null,6,0]
[{"$f":"IF(RAND()<0.5,1,0)","v":1},0,0,1,1,0,0,0,0,0,0,0,1,0,0,0,0,0,0,0,null,null,3,0,null,4,0]
[1,0,0,1,0,1,0,0,0,0,0,1,0,1,1,0,0,1,1,1,null,null,3,0,null,9,0]
[0,1,1,1,1,1,0,0,1,0,1,1,1,1,1,0,0,1,0,0,null,null,6,1,null,12,1]
[1,0,1,0,0,1,1,1,0,1,0,1,0,0,0,0,0,1,0,1,null,null,6,1,null,9,0]
[0,0,1,1,0,1,1,0,0,1,0,0,1,1,1,1,0,0,0,0,null,null,5,0,null,9,0]
[0,0,1,0,0,0,1,0,0,0,1,1,0,0,1,1,1,1,1,1,null,null,2,0,null,10,0]
[0,1,0,1,1,0,0,0,0,0,0,1,0,0,1,1,0,0,1,0,null,null,3,0,null,7,0]
[0,0,1,0,1,1,1,0,0,0,1,1,1,0,0,0,1,1,0,0,null,null,4,0,null,9,0]
[0,0,1,1,1,1,1,1,1,0,0,0,0,1,0,1,1,0,0,0,null,null,7,1,null,10,0]
[1,1,1,0,0,1,0,0,0,1,0,0,1,1,0,1,1,0,1,1,null,null,5,0,null,11,0]
[0,1,0,0,1,0,0,0,1,0,1,0,0,1,1,1,0,1,1,1,null,null,3,0,null,10,0]
[1,1,0,1,1,0,1,0,0,1,0,0,0,1,1,1,0,0,1,0,null,null,6,1,null,10,0]
[1,1,1,0,0,0,1,0,1,1,1,1,1,0,0,0,1,0,0,1,null,null,6,1,null,11,0]
[1,1,1,0,0,1,0,0,0,0,0,1,0,1,0,0,0,0,1,0,null,null,4,0,null,7,0]
[0,0,0,1,0,1,0,1,0,0,0,0,1,1,0,1,1,0,0,1,null,null,3,0,null,8,0]
[0,1,1,1,1,1,1,0,1,0,1,1,0,1,1,{"$f":"IF(RAND()<0.5,1,0)","v":1},1,1,1,1,null,null,7,1,null,16,1]
[{"$f":"IF(RAND()<0.5,1,0)","v":0},1,0,0,1,1,0,1,1,0,1,1,0,0,0,0,1,0,1,1,null,null,5,0,null,10,0]
[0,1,0,1,0,0,0,1,0,0,1,0,0,0,1,0,0,0,1,1,null,null,3,0,null,7,0]
[1,0,1,1,1,1,0,1,0,0,0,0,0,0,0,0,0,1,1,1,null,null,6,1,null,9,0]
[0,1,1,0,0,1,1,0,1,1,1,0,1,1,0,0,0,0,1,1,null,null,6,1,null,11,0]
[1,1,1,0,0,0,1,0,0,0,1,0,0,1,1,1,1,0,1,0,null,null,4,0,null,10,0]
[1,0,1,0,1,0,1,0,0,1,1,0,0,0,0,1,1,1,0,1,null,null,5,0,null,10,0]
[1,1,0,1,1,1,1,1,1,1,0,1,0,0,0,0,1,1,0,0,null,null,9,1,null,12,1]
[1,1,1,0,0,0,0,0,1,0,1,1,1,1,0,0,0,1,1,1,null,null,4,0,null,11,0]
[1,0,0,1,1,1,1,1,0,1,0,0,1,1,0,0,1,0,0,1,null,null,7,1,null,11,0]
[0,1,1,0,1,1,0,1,1,0,0,0,0,1,1,1,1,1,0,0,null,null,6,1,null,11,0]
[1,1,0,0,0,1,1,1,0,1,1,0,0,0,1,0,0,0,0,0,null,null,6,1,null,8,0]
[1,1,1,1,0,1,0,1,0,0,1,1,0,1,1,1,1,1,0,1,null,null,6,1,null,14,1]
[0,0,0,1,0,1,1,0,0,0,0,0,1,1,1,0,0,0,0,1,null,null,3,0,null,7,0]
[1,0,0,1,0,0,1,1,0,1,0,1,0,0,1,0,1,1,0,0,null,null,5,0,null,9,0]
[0,1,0,1,1,0,1,1,0,0,0,1,1,1,1,0,1,1,1,0,null,null,5,0,null,12,1]
[1,1,0,0,0,1,1,1,1,0,1,1,1,1,1,{"$f":"IF(RAND()<0.5,1,0)","v":1},1,0,0,1,null,null,6,1,null,14,1]
[{"$f":"IF(RAND()<0.5,1,0)","v":0},0,1,1,1,0,1,0,0,0,0,0,1,1,0,0,0,0,0,0,null,null,4,0,null,6,0]
[1,0,1,1,0,1,0,1,0,1,0,0,0,0,0,1,0,0,1,0,null,null,6,1,null,8,0]
[1,0,0,1,0,1,0,0,1,0,1,0,0,1,0,0,0,1,0,1,null,null,4,0,null,8,0]
[0,1,0,0,0,0,0,0,0,0,1,0,1,1,1,0,0,1,1,0,null,null,1,0,null,7,0]
[0,0,0,1,1,0,0,0,0,0,0,1,1,0,0,1,1,0,0,0,null,null,2,0,null,6,0]
[0,0,1,1,0,0,1,1,1,0,1,1,0,1,1,0,0,1,1,0,null,null,5,0,null,11,0]
[1,0,1,1,1,1,1,0,0,1,1,1,0,0,1,1,1,0,1,0,null,null,7,1,null,13,1]
[1,1,0,0,0,1,0,0,1,1,0,0,1,0,1,0,1,1,1,1,null,null,5,0,null,11,0]
[0,1,1,0,0,0,1,1,1,0,1,0,1,0,1,0,1,1,0,1,null,null,5,0,null,11,0]
[1,1,1,0,0,1,0,1,0,0,1,0,1,1,1,1,1,1,1,1,null,null,5,0,null,14,1]
[0,1,1,0,0,0,0,1,0,1,0,1,1,1,0,0,0,1,0,0,null,null,4,0,null,8,0]
[0,0,1,0,1,1,0,0,1,0,0,1,0,1,0,1,0,1,1,1,null,null,4,0,null,10,0]
[0,0,0,1,0,1,1,0,1,1,0,1,0,0,0,1,1,0,0,0,null,null,5,0,null,8,0]
[0,0,1,0,1,1,1,1,0,1,0,0,1,1,1,0,0,1,1,0,null,null,6,1,null,11,0]
[1,1,1,1,0,0,1,1,0,1,0,0,0,1,1,1,0,0,1,1,null,null,7,1,null,12,1]
[1,1,1,0,0,1,0,1,0,1,0,0,0,0,1,{"$f":"IF(RAND()<0.5,1,0)","v":1},0,1,1,1,null,null,6,1,null,11,0]
[{"$f":"IF(RAND()<0.5,1,0)","v":0},1,0,1,1,0,0,1,0,1,0,0,1,0,1,0,1,0,1,1,null,null,5,0,null,10,0]
[0,1,0,1,1,1,0,0,0,1,0,0,0,1,1,0,0,1,0,0,null,null,5,0,null,8,0]
[1,0,0,0,0,0,1,1,1,0,1,1,0,1,0,0,1,0,1,0,null,null,4,0,null,9,0]
[1,0,1,0,1,1,1,1,1,1,1,0,1,1,1,1,1,1,0,0,null,null,{"$f":"SUM(A643:J643)","v":8},{"$f":"IF(W643>=6,1,0)","v":1},null,{"$f":"SUM(A643:T643)","v":15},{"$f":"IF(Z643>=12,1,0)","v":1}]
[0,0,1,0,1,0,1,0,0,0,0,0,0,0,0,0,1,0,0,0,null,null,3,0,null,4,0]
[1,1,0,0,0,1,1,0,1,1,1,1,0,0,0,0,0,0,0,1,null,null,6,1,null,9,0]
[0,0,0,0,1,1,0,1,1,0,1,0,1,1,1,0,1,1,1,0,null,null,4,0,null,11,0]
[1,1,1,1,1,1,1,0,0,1,1,1,1,0,0,1,1,1,0,0,null,null,8,1,null,14,1]
[1,0,1,0,0,0,0,1,1,1,0,1,0,0,0,0,1,1,1,1,null,null,5,0,null,10,0]
[0,0,1,1,0,0,0,1,1,0,0,0,1,1,1,0,0,0,1,1,null,null,4,0,null,9,0]
[0,0,1,0,1,1,1,1,0,0,0,1,1,0,0,0,0,0,1,0,null,null,5,0,null,8,0]
[0,1,1,1,0,0,1,0,0,0,1,1,0,0,1,0,0,0,1,1,null,null,4,0,null,9,0]
[1,0,0,0,1,0,0,1,1,0,0,1,0,0,1,1,1,1,1,0,null,null,4,0,null,10,0]
[1,0,1,0,1,0,0,1,0,0,1,0,0,1,0,1,1,0,1,0,null,null,4,0,null,9,0]
[0,0,1,0,0,0,1,0,0,0,1,1,1,1,1,1,0,0,1,0,null,null,2,0,null,9,0]
[0,0,1,0,0,1,0,0,1,0,1,0,0,1,0,{"$f":"IF(RAND()<0.5,1,0)","v":1},1,1,0,0,null,null,3,0,null,8,0]
[{"$f":"IF(RAND()<0.5,1,0)","v":0},0,0,0,1,0,0,0,1,1,0,1,1,1,1,1,1,0,1,0,null,null,3,0,null,10,0]
[1,1,1,0,1,1,0,1,0,1,1,0,1,1,0,0,1,1,1,1,null,null,7,1,null,14,1]
[1,0,1,1,1,0,1,0,1,1,1,1,1,1,1,1,0,0,0,0,null,null,7,1,null,13,1]
[0,0,1,1,0,0,1,1,1,0,0,0,0,0,1,1,1,1,1,1,null,null,5,0,null,11,0]
[1,1,0,0,1,0,1,0,0,1,1,1,0,1,0,0,1,1,0,1,null,null,5,0,null,11,0]
[0,1,0,0,1,0,0,0,1,1,0,0,0,1,1,0,0,0,0,1,null,null,4,0,null,7,0]
[1,0,1,1,0,0,1,1,0,0,1,1,1,0,1,0,0,1,1,0,null,null,5,0,null,11,0]
[1,0,0,1,1,1,0,1,1,1,1,0,0,1,0,0,1,1,0,1,null,null,7,1,null,12,1]
[0,0,0,1,0,0,0,0,0,0,1,0,0,0,0,0,1,1,0,1,null,null,1,0,null,5,0]
[1,1,1,0,1,0,0,0,0,0,0,1,0,1,1,0,0,0,0,1,null,null,4,0,null,8,0]
[0,0,0,1,1,0,1,0,1,1,1,0,0,1,1,1,1,0,1,1,null,null,5,0,null,12,1]
[1,0,0,0,0,0,0,0,0,1,0,0,1,0,0,1,1,0,1,0,null,null,2,0,null,6,0]
[0,1,0,0,1,1,0,0,0,0,1,0,0,1,0,0,1,1,1,1,null,null,3,0,null,9,0]
[0,1,1,1,1,0,1,1,0,0,0,1,0,1,1,0,1,1,0,1,null,null,6,1,null,12,1]
[1,0,1,0,1,0,0,1,1,1,1,1,1,0,0,1,1,0,0,0,null,null,6,1,null,11,0]
[1,1,0,0,1,1,1,1,0,0,1,1,0,0,1,{"$f":"IF(RAND()<0.5,1,0)","v":0},1,1,0,1,null,null,6,1,null,12,1]
[{"$f":"IF(RAND()<0.5,1,0)","v":0},1,0,0,0,0,0,0,0,0,1,0,1,0,0,0,1,0,1,0,null,null,1,0,null,5,0]
[1,0,1,0,1,1,0,1,1,0,1,1,0,0,1,0,1,1,0,0,null,null,6,1,null,11,0]
[1,0,1,0,0,0,1,1,0,0,0,1,0,0,1,0,1,1,0,1,null,null,4,0,null,9,0]
[1,0,0,1,0,1,1,1,1,0,1,0,1,0,1,1,1,0,1,0,null,null,6,1,null,12,1]
[1,0,1,0,1,1,1,0,1,0,1,0,1,1,1,0,1,0,1,1,null,null,6,1,null,13,1]
[1,0,0,0,0,0,1,0,0,1,0,1,1,0,1,1,1,1,1,0,null,null,3,0,null,10,0]
[0,1,1,0,1,0,0,0,0,1,1,0,1,1,0,1,1,1,1,1,null,null,4,0,null,12,1]
[0,0,1,1,1,1,1,0,1,0,1,1,1,0,0,0,1,0,0,0,null,null,6,1,null,10,0]
[1,0,0,1,1,0,0,1,0,0,0,0,1,1,1,0,1,1,0,0,null,null,4,0,null,9,0]
[0,1,0,0,1,0,1,0,0,0,0,0,1,1,1,1,1,0,0,0,null,null,3,0,null,8,0]
[1,0,0,0,0,0,0,0,1,1,1,0,0,0,0,0,0,1,0,0,null,null,3,0,null,5,0]
[0,0,0,1,1,1,1,0,1,0,1,0,1,1,1,0,1,0,1,1,null,null,5,0,null,12,1]
[0,1,0,1,0,1,1,1,0,0,0,1,0,0,0,0,0,0,1,0,null,null,5,0,null,7,0]
[1,1,0,0,0,0,1,0,0,1,1,1,0,1,0,0,0,0,1,0,null,null,4,0,null,8,0]
[0,1,0,1,1,1,0,1,0,0,1,1,0,1,0,1,1,0,0,0,null,null,5,0,null,10,0]
[1,0,0,1,0,0,0,0,0,0,1,0,1,0,1,{"$f":"IF(RAND()<0.5,1,0)","v":0},1,1,0,1,null,null,2,0,null,8,0]
[{"$f":"IF(RAND()<0.5,1,0)","v":1},0,1,0,1,1,0,1,0,1,0,0,0,1,1,0,0,1,1,1,null,null,6,1,null,11,0]
[1,0,1,0,1,1,1,1,0,1,0,0,1,1,0,0,0,1,0,0,null,null,7,1,null,10,0]
[1,0,0,1,0,1,1,0,0,1,1,0,1,0,0,0,0,0,1,1,null,null,5,0,null,9,0]
[0,0,0,1,1,0,1,1,1,0,1,1,1,1,1,0,0,1,1,0,null,null,5,0,null,12,1]
[1,1,0,0,1,0,0,1,0,0,0,1,0,0,0,0,1,0,1,1,null,null,4,0,null,8,0]
[1,0,1,0,0,1,0,1,0,0,0,0,0,1,0,0,0,1,1,1,null,null,4,0,null,8,0]
[0,0,0,1,1,1,1,0,0,1,0,0,1,1,1,0,0,0,0,0,null,null,5,0,null,8,0]
[0,1,0,1,0,0,0,0,0,1,1,0,0,0,0,0,1,1,0,1,null,null,3,0,null,7,0]
[1,0,1,1,1,1,1,0,1,0,0,0,0,1,1,1,1,0,0,0,null,null,7,1,null,11,0]
[1,1,1,0,0,0,1,0,0,0,0,0,1,0,1,0,1,0,1,1,null,null,4,0,null,9,0]
[0,1,1,0,0,0,0,0,1,1,1,1,0,0,1,1,0,1,0,1,null,null,4,0,null,10,0]
[0,0,1,0,1,0,1,1,0,0,1,0,1,1,1,1,1,0,0,1,null,null,4,0,null,11,0]
[0,1,0,0,0,1,0,0,0,1,0,0,1,0,1,1,0,0,1,1,null,null,3,0,null,8,0]
[1,1,1,1,1,1,0,1,0,0,0,0,1,1,1,0,0,0,0,0,null,null,7,1,null,10,0]
[1,0,0,1,1,1,0,0,1,1,0,0,1,1,0,1,0,1,1,1,null,null,6,1,null,12,1]
[0,0,0,1,0,1,0,0,0,1,0,0,0,1,1,{"$f":"IF(RAND()<0.5,1,0)","v":0},1,1,1,1,null,null,3,0,null,9,0]
[{"$f":"IF(RAND()<0.5,1,0)","v":1},1,0,0,1,0,1,1,1,1,0,0,0,0,0,1,0,0,0,0,null,null,7,1,null,8,0]
[1,1,1,1,0,0,1,0,1,1,1,0,0,1,1,1,0,1,1,0,null,null,7,1,null,13,1]
[0,1,1,1,1,1,0,1,1,1,1,1,0,1,0,0,1,1,0,1,null,null,8,1,null,14,1]
[1,0,0,1,0,1,1,0,1,1,1,1,0,1,1,0,1,1,1,0,null,null,{"$f":"SUM(A707:J707)","v":6},{"$f":"IF(W707>=6,1,0)","v":1},null,{"$f":"SUM(A707:T707)","v":13},{"$f":"IF(Z707>=12,1,0)","v":1}]
[1,1,0,0,0,0,0,0,0,0,1,1,1,0,1,1,1,0,0,0,null,null,2,0,null,8,0]
[0,0,0,0,1,0,1,0,0,0,1,0,1,1,0,0,1,0,0,0,null,null,2,0,null,6,0]
[0,1,1,0,1,1,0,1,0,1,0,0,1,0,0,0,0,0,0,0,null,null,6,1,null,7,0]
[0,0,0,1,1,0,0,0,0,1,0,0,0,1,0,0,0,1,1,1,null,null,3,0,null,7,0]
[1,1,0,0,0,1,1,0,1,0,0,0,1,0,0,0,1,0,1,0,null,null,5,0,null,8,0]
[1,0,1,1,0,1,0,0,0,0,1,0,0,1,1,0,1,1,0,0,null,null,4,0,null,9,0]
[1,1,1,0,1,1,0,1,1,1,1,1,1,1,0,1,0,0,1,1,null,null,8,1,null,15,1]
[1,0,1,1,0,0,0,1,0,1,0,1,1,0,1,0,1,0,0,0,null,null,5,0,null,9,0]
[0,1,0,1,0,0,0,0,1,1,0,0,1,0,1,0,0,0,1,1,null,null,4,0,null,8,0]
[0,1,0,0,1,0,0,0,0,0,1,0,1,1,0,0,1,0,1,1,null,null,2,0,null,8,0]
[1,0,1,1,1,0,0,0,0,0,1,1,0,1,0,1,1,0,0,1,null,null,4,0,null,10,0]
[0,1,0,0,0,0,0,1,0,0,1,0,0,1,1,{"$f":"IF(RAND()<0.5,1,0)","v":0},1,0,0,0,null,null,2,0,null,6,0]
[{"$f":"IF(RAND()<0.5,1,0)","v":0},1,0,0,1,0,1,1,0,1,0,1,0,1,0,0,0,0,0,1,null,null,5,0,null,8,0]
[1,1,1,1,1,1,1,0,1,1,0,1,1,0,0,0,0,0,0,0,null,null,9,1,null,11,0]
[0,1,1,0,1,0,1,1,1,1,1,1,1,0,1,0,1,0,0,0,null,null,7,1,null,12,1]
[0,1,1,0,1,0,0,1,0,0,1,0,1,1,1,0,1,1,1,0,null,null,4,0,null,11,0]
[1,0,0,1,0,0,1,0,1,0,1,0,1,0,1,0,1,0,1,0,null,null,4,0,null,9,0]
[1,0,1,1,1,0,0,0,0,0,1,1,0,0,0,1,1,0,0,1,null,null,4,0,null,9,0]
[0,1,1,0,1,1,1,0,1,0,0,0,0,0,1,0,0,0,0,0,null,null,6,1,null,7,0]
[1,0,0,0,0,1,0,1,1,0,1,0,1,1,1,1,1,0,1,1,null,null,4,0,null,12,1]
[1,0,0,0,1,1,0,1,0,0,1,0,1,0,1,1,1,0,0,1,null,null,4,0,null,10,0]
[0,0,1,0,0,0,1,1,1,0,1,1,1,0,0,0,1,1,0,0,null,null,4,0,null,9,0]
[0,0,0,1,0,0,0,1,1,1,1,0,1,0,1,1,1,0,0,0,null,null,4,0,null,9,0]
[0,0,0,0,1,1,1,1,1,1,1,0,1,1,1,0,1,1,1,1,null,null,6,1,null,14,1]
[0,1,0,0,0,1,1,0,1,1,0,1,0,1,1,1,0,0,1,0,null,null,5,0,null,10,0]
[0,1,1,0,0,0,0,0,0,0,1,0,1,1,0,0,0,1,0,0,null,null,2,0,null,6,0]
[1,1,0,1,1,0,1,0,1,0,0,0,0,1,1,0,1,0,0,1,null,null,6,1,null,10,0]
[0,1,0,1,0,1,1,1,0,1,0,0,0,0,0,{"$f":"IF(RAND()<0.5,1,0)","v":1},1,0,0,0,null,null,6,1,null,8,0]
[{"$f":"IF(RAND()<0.5,1,0)","v":0},1,1,1,1,1,1,1,1,0,0,1,0,1,0,1,0,0,0,0,null,null,8,1,null,11,0]
[0,1,0,0,0,1,1,0,0,0,1,1,1,0,0,0,0,1,0,0,null,null,3,0,null,7,0]
[1,1,0,1,1,1,1,1,0,1,1,1,0,1,0,1,0,0,1,0,null,null,8,1,null,13,1]
[0,1,0,0,0,0,1,0,1,1,1,0,0,1,1,1,0,1,1,1,null,null,4,0,null,11,0]
[0,0,0,1,0,1,1,1,1,1,0,1,1,1,0,0,1,0,1,1,null,null,6,1,null,12,1]
[0,1,0,0,1,1,1,0,0,0,1,1,0,0,1,1,0,0,1,0,null,null,4,0,null,9,0]
[1,1,0,1,0,1,0,1,0,1,0,0,0,0,1,0,0,0,1,1,null,null,6,1,null,9,0]
[0,0,1,1,1,0,1,0,1,1,1,1,0,1,0,0,0,0,1,1,null,null,6,1,null,11,0]
[0,0,0,0,1,1,1,0,0,1,0,1,1,0,1,1,1,0,1,1,null,null,4,0,null,11,0]
[1,1,0,1,1,1,1,0,0,1,1,0,1,1,1,0,0,0,0,0,null,null,7,1,null,11,0]
[1,1,0,1,0,0,1,1,0,1,1,1,1,1,1,1,0,0,1,0,null,null,6,1,null,13,1]
[1,1,1,1,0,1,1,1,1,1,0,0,1,0,1,0,1,0,0,1,null,null,9,1,null,13,1]
[1,1,0,1,0,0,0,0,1,0,1,1,0,0,0,0,1,0,1,1,null,null,4,0,null,9,0]
[0,0,0,1,0,0,1,1,0,0,0,0,0,1,0,0,1,1,0,1,null,null,3,0,null,7,0]
[1,0,1,0,1,0,0,1,0,1,0,1,1,0,0,1,0,0,0,1,null,null,5,0,null,9,0]
[0,1,1,1,0,0,1,0,1,1,1,1,1,0,0,{"$f":"IF(RAND()<0.5,1,0)","v":0},0,1,0,1,null,null,6,1,null,11,0]
[{"$f":"IF(RAND()<0.5,1,0)","v":1},1,1,1,1,0,0,0,0,0,1,0,1,0,0,1,1,0,0,0,null,null,5,0,null,9,0]
[0,1,1,0,0,1,0,0,0,1,0,0,1,1,1,0,1,0,1,0,null,null,4,0,null,9,0]
[0,1,1,0,1,1,0,1,0,0,1,0,1,1,1,1,1,0,0,1,null,null,5,0,null,12,1]
[1,0,0,1,1,1,0,1,0,0,0,0,0,1,1,0,0,1,1,0,null,null,5,0,null,9,0]
[1,0,1,0,1,0,0,1,0,0,1,0,1,0,1,1,1,0,0,1,null,null,4,0,null,10,0]
[1,0,1,1,0,0,1,0,1,0,0,1,1,1,1,1,1,1,1,1,null,null,5,0,null,14,1]
[1,1,0,1,0,0,0,1,1,0,1,1,1,0,0,1,1,1,0,0,null,null,5,0,null,11,0]
[0,0,0,0,0,0,1,1,0,0,1,0,0,1,0,1,0,0,0,1,null,null,2,0,null,6,0]
[1,0,1,0,0,0,0,1,0,1,1,0,1,0,1,1,0,1,0,1,null,null,4,0,null,10,0]
[0,1,1,1,0,0,1,1,1,1,1,0,1,0,0,1,1,0,0,1,null,null,7,1,null,12,1]
[0,1,1,0,1,0,0,1,0,0,1,0,0,1,1,0,0,0,1,1,null,null,4,0,null,9,0]
[1,0,1,0,0,0,0,0,0,1,1,0,1,1,1,1,1,0,1,1,null,null,3,0,null,11,0]
[1,0,0,0,1,1,0,1,1,0,1,0,0,1,1,0,0,1,0,0,null,null,5,0,null,9,0]
[0,1,0,1,0,0,0,0,1,0,1,1,1,1,0,1,1,0,0,0,null,null,3,0,null,9,0]
[1,1,1,1,0,1,0,1,1,1,1,1,0,0,0,1,0,0,0,0,null,null,8,1,null,11,0]
[1,1,0,1,1,1,1,1,1,1,0,0,0,1,0,{"$f":"IF(RAND()<0.5,1,0)","v":0},1,1,1,1,null,null,9,1,null,14,1]
[{"$f":"IF(RAND()<0.5,1,0)","v":1},0,0,0,1,1,0,1,0,1,0,0,0,0,0,0,0,1,0,0,null,null,5,0,null,6,0]
[0,0,0,1,0,0,0,1,1,1,1,1,1,1,0,0,1,0,0,0,null,null,4,0,null,9,0]
[1,1,0,0,1,1,1,0,0,0,1,0,0,0,1,0,1,0,1,1,null,null,5,0,null,10,0]
[1,1,1,0,0,0,0,0,1,0,0,0,0,1,0,0,0,0,1,0,null,null,{"$f":"SUM(A771:J771)","v":4},{"$f":"IF(W771>=6,1,0)","v":0},null,{"$f":"SUM(A771:T771)","v":6},{"$f":"IF(Z771>=12,1,0)","v":0}]
[1,0,0,1,1,0,1,0,1,0,1,0,1,0,1,0,1,0,0,1,null,null,5,0,null,10,0]
[0,0,1,1,0,1,1,1,0,1,0,0,1,1,0,0,1,1,1,1,null,null,6,1,null,12,1]
[0,1,1,0,0,0,0,0,1,1,0,0,1,0,0,1,0,0,1,1,null,null,4,0,null,8,0]
[1,1,0,0,1,0,1,1,0,0,0,0,0,1,0,0,1,0,1,0,null,null,5,0,null,8,0]
[1,0,1,0,1,1,1,1,0,1,0,1,0,0,1,1,1,1,0,0,null,null,7,1,null,12,1]
[1,0,1,1,0,1,0,0,1,0,0,0,0,0,0,0,1,1,0,1,null,null,5,0,null,8,0]
[0,1,0,1,0,1,1,0,0,1,1,0,1,0,1,0,0,1,0,1,null,null,5,0,null,10,0]
[1,0,1,1,0,0,0,0,0,0,0,0,1,0,0,0,0,0,0,1,null,null,3,0,null,5,0]
[0,1,0,0,1,1,1,0,0,0,0,1,0,1,0,1,0,1,0,1,null,null,4,0,null,9,0]
[0,0,0,1,0,0,0,0,0,0,0,0,1,1,0,1,1,0,0,0,null,null,1,0,null,5,0]
[0,0,1,0,0,1,0,0,1,0,1,0,0,1,0,1,0,0,1,1,null,null,3,0,null,8,0]
[0,1,0,1,0,1,0,0,0,0,1,0,0,1,1,{"$f":"IF(RAND()<0.5,1,0)","v":1},0,1,1,1,null,null,3,0,null,10,0]
[{"$f":"IF(RAND()<0.5,1,0)","v":1},0,1,0,0,0,0,1,0,0,1,0,0,0,1,0,0,0,0,1,null,null,3,0,null,6,0]
[1,1,1,0,1,1,0,1,0,0,0,1,1,0,0,0,0,0,0,1,null,null,6,1,null,9,0]
[0,0,0,1,1,1,0,1,1,1,0,0,1,0,0,0,0,1,0,1,null,null,6,1,null,9,0]
[0,1,0,1,0,0,1,1,1,1,1,0,1,0,0,0,0,0,0,1,null,null,6,1,null,9,0]
[0,1,0,1,1,1,1,1,1,1,0,1,0,1,1,0,0,0,1,1,null,null,8,1,null,13,1]
[1,1,1,0,1,1,0,1,0,0,1,1,1,1,0,0,1,0,0,0,null,null,6,1,null,11,0]
[0,1,1,0,0,0,1,1,0,0,0,1,0,1,1,0,1,1,0,0,null,null,4,0,null,9,0]
[1,1,1,1,0,0,1,1,1,1,0,1,1,1,0,1,0,1,0,0,null,null,8,1,null,13,1]
[1,1,0,0,0,0,1,0,0,1,1,1,0,0,0,0,1,1,0,1,null,null,4,0,null,9,0]
[0,0,0,0,0,1,0,0,1,0,0,1,1,1,0,1,0,0,1,0,null,null,2,0,null,7,0]
[0,0,1,0,1,0,1,1,0,0,0,1,0,0,1,0,0,0,1,0,null,null,4,0,null,7,0]
[1,1,1,0,1,1,1,1,0,1,1,0,0,1,1,1,1,0,1,1,null,null,8,1,null,15,1]
[1,0,0,0,1,0,0,1,0,1,0,0,1,1,0,1,0,0,0,1,null,null,4,0,null,8,0]
[1,1,0,1,0,0,0,1,0,1,0,0,1,1,1,0,1,1,1,0,null,null,5,0,null,11,0]
[1,1,0,1,0,1,0,0,0,0,0,1,0,0,1,1,1,0,1,0,null,null,4,0,null,9,0]
[1,1,0,1,0,0,0,1,0,1,1,0,0,1,1,{"$f":"IF(RAND()<0.5,1,0)","v":1},0,0,0,0,null,null,5,0,null,9,0]
[{"$f":"IF(RAND()<0.5,1,0)","v":1},1,0,0,1,1,1,1,0,1,0,0,0,1,0,1,0,0,0,1,null,null,7,1,null,10,0]
[1,0,1,1,0,1,1,1,0,1,1,1,0,0,1,1,1,1,0,0,null,null,7,1,null,13,1]
[1,0,0,1,0,1,0,0,0,0,0,1,0,0,0,0,0,1,0,0,null,null,3,0,null,5,0]
[1,1,0,1,1,1,0,0,1,1,1,1,1,0,0,0,1,0,1,0,null,null,7,1,null,12,1]
[1,0,1,1,1,1,1,0,0,0,1,0,0,0,1,1,0,1,1,0,null,null,6,1,null,11,0]
[1,1,1,0,1,0,0,1,1,1,0,1,0,0,0,0,0,0,1,0,null,null,7,1,null,9,0]
[0,0,1,1,1,1,1,1,0,0,1,0,1,1,0,1,0,1,0,1,null,null,6,1,null,12,1]
[0,0,1,0,1,1,0,0,0,1,1,1,0,0,1,1,0,1,1,0,null,null,4,0,null,10,0]
[0,1,1,1,0,0,0,1,0,0,1,1,1,0,1,1,1,1,1,1,null,null,4,0,null,13,1]
[0,1,1,1,0,1,1,0,0,1,0,0,1,0,1,0,0,1,0,0,null,null,6,1,null,9,0]
[1,0,1,1,0,0,1,1,0,1,1,0,0,1,1,1,1,1,0,0,null,null,6,1,null,12,1]
[0,1,0,0,1,1,0,0,1,1,0,0,1,1,0,1,1,1,0,0,null,null,5,0,null,10,0]
[0,1,0,1,0,0,1,1,1,1,0,1,0,1,1,0,0,0,0,1,null,null,6,1,null,10,0]
[1,0,0,0,0,0,1,1,0,0,1,1,0,1,1,1,1,1,0,0,null,null,3,0,null,10,0]
[1,1,1,1,1,1,0,1,0,0,1,1,0,1,1,1,0,1,0,1,null,null,7,1,null,14,1]
[0,0,1,0,0,0,1,1,0,1,0,1,1,0,0,{"$f":"IF(RAND()<0.5,1,0)","v":1},1,0,1,1,null,null,4,0,null,10,0]
[{"$f":"IF(RAND()<0.5,1,0)","v":0},0,0,1,1,0,0,1,0,0,0,1,0,1,0,0,1,1,1,1,null,null,3,0,null,9,0]
[0,0,1,1,0,1,0,1,1,0,1,0,1,0,1,1,0,0,0,0,null,null,5,0,null,9,0]
[1,1,0,1,0,0,1,1,0,1,0,0,0,1,1,1,0,0,1,1,null,null,6,1,null,11,0]
[1,1,1,1,1,1,0,1,0,1,0,0,0,0,0,0,1,0,1,0,null,null,8,1,null,10,0]
[1,1,1,0,0,0,1,0,1,1,0,0,1,0,0,0,0,1,0,1,null,null,6,1,null,9,0]
[0,0,0,0,0,1,1,1,0,0,1,1,0,1,0,0,0,1,0,0,null,null,3,0,null,7,0]
[0,1,0,1,1,0,1,1,0,0,1,1,0,1,0,0,1,1,1,0,null,null,5,0,null,11,0]
[1,1,1,1,0,0,1,0,1,1,0,1,1,1,1,1,1,0,1,0,null,null,7,1,null,14,1]
[1,1,1,1,1,0,0,1,0,0,1,1,0,1,0,0,1,1,1,0,null,null,6,1,null,12,1]
[1,0,0,0,1,1,1,1,1,1,1,1,1,0,0,1,0,0,0,1,null,null,7,1,null,12,1]
[0,0,0,0,0,0,1,0,0,1,0,0,1,0,0,0,0,1,1,0,null,null,2,0,null,5,0]
[0,0,1,0,1,0,1,0,1,0,0,1,0,0,0,1,0,0,0,1,null,null,4,0,null,7,0]
[1,0,1,0,1,0,1,1,1,0,1,1,0,0,1,1,1,1,1,0,null,null,6,1,null,13,1]
[1,1,0,1,0,1,0,0,0,0,1,0,0,1,1,0,1,1,1,0,null,null,4,0,null,10,0]
[1,1,0,0,0,1,0,1,0,0,0,1,1,1,1,1,0,0,1,0,null,null,4,0,null,10,0]
[1,1,1,1,0,1,1,0,1,0,1,1,1,1,0,{"$f":"IF(RAND()<0.5,1,0)","v":0},1,0,1,1,null,null,7,1,null,14,1]
[{"$f":"IF(RAND()<0.5,1,0)","v":1},0,0,1,1,1,0,0,0,1,1,1,0,1,0,1,0,1,1,1,null,null,5,0,null,12,1]
[1,0,1,0,1,1,1,1,1,0,0,0,0,0,0,0,1,1,0,1,null,null,7,1,null,10,0]
[1,1,1,0,1,0,1,1,0,1,1,0,0,1,1,1,0,1,1,0,null,null,7,1,null,13,1]
[0,1,1,0,0,1,1,1,1,1,1,1,0,0,0,1,1,0,1,1,null,null,{"$f":"SUM(A835:J835)","v":7},{"$f":"IF(W835>=6,1,0)","v":1},null,{"$f":"SUM(A835:T835)","v":13},{"$f":"IF(Z835>=12,1,0)","v":1}]
[0,0,0,1,1,1,0,1,0,1,0,1,0,1,1,0,1,0,0,1,null,null,5,0,null,10,0]
[1,0,1,1,0,1,0,0,1,1,0,0,0,0,0,0,0,0,0,1,null,null,6,1,null,7,0]
[1,0,1,1,1,0,1,1,1,1,1,0,1,1,0,1,0,0,1,0,null,null,8,1,null,13,1]
[0,1,0,1,1,1,0,0,0,1,1,1,0,0,0,0,1,0,0,1,null,null,5,0,null,9,0]
[1,0,1,0,1,1,0,0,1,0,1,0,1,1,0,1,1,1,0,1,null,null,5,0,null,12,1]
[0,0,1,0,0,0,0,1,1,0,1,0,0,1,1,1,1,0,0,1,null,null,3,0,null,9,0]
[1,0,1,0,0,1,1,0,1,1,0,0,0,1,1,0,1,0,1,1,null,null,6,1,null,11,0]
[0,1,1,1,1,1,1,0,1,0,0,1,1,1,1,1,0,0,0,1,null,null,7,1,null,13,1]
[1,1,0,0,1,0,0,0,0,0,0,0,1,0,1,1,0,0,0,1,null,null,3,0,null,7,0]
[1,0,1,0,1,1,1,1,0,1,1,0,0,1,1,1,1,0,1,1,null,null,7,1,null,14,1]
[1,0,0,0,1,1,0,0,0,0,1,1,1,0,1,0,0,0,1,1,null,null,3,0,null,9,0]
[1,0,1,0,0,0,0,0,1,1,1,1,0,1,1,{"$f":"IF(RAND()<0.5,1,0)","v":1},0,0,1,0,null,null,4,0,null,10,0]
[{"$f":"IF(RAND()<0.5,1,0)","v":0},1,1,1,0,1,1,1,0,0,0,1,1,0,0,0,1,0,1,1,null,null,6,1,null,11,0]
[1,0,1,1,0,0,0,0,0,1,1,0,0,1,1,1,0,0,1,1,null,null,4,0,null,10,0]
[0,1,1,0,0,1,0,0,1,1,0,1,1,1,1,1,0,1,0,1,null,null,5,0,null,12,1]
[0,0,1,0,0,1,0,1,0,1,0,0,0,1,0,1,0,0,1,1,null,null,4,0,null,8,0]
[0,0,0,1,0,1,1,1,0,0,0,1,1,0,1,0,0,0,0,1,null,null,4,0,null,8,0]
[0,0,1,1,0,0,1,1,0,1,0,0,1,0,0,1,1,0,0,1,null,null,5,0,null,9,0]
[0,0,0,0,1,0,1,0,0,1,0,0,1,1,1,1,1,0,0,0,null,null,3,0,null,8,0]
[1,1,1,0,0,0,0,0,0,0,0,0,1,1,0,1,0,0,1,0,null,null,3,0,null,7,0]
[0,1,1,0,0,1,0,1,0,0,0,1,0,1,1,0,1,1,1,0,null,null,4,0,null,10,0]
[1,0,1,0,0,1,1,0,0,1,1,1,1,1,1,1,0,1,0,0,null,null,5,0,null,12,1]
[0,1,1,1,0,0,0,1,0,1,1,0,0,0,1,0,1,0,0,1,null,null,5,0,null,9,0]
[1,1,1,1,0,0,0,1,1,0,0,0,0,0,0,1,1,1,1,0,null,null,6,1,null,10,0]
[1,0,1,1,1,0,0,1,0,1,0,1,0,1,1,0,0,0,0,1,null,null,6,1,null,10,0]
[0,1,1,1,1,0,1,1,0,0,1,0,0,0,0,1,1,0,1,1,null,null,6,1,null,11,0]
[0,0,0,1,1,1,0,1,0,1,0,0,1,1,0,1,1,0,1,0,null,null,5,0,null,10,0]
[0,1,1,1,1,0,0,0,0,1,0,1,0,1,1,{"$f":"IF(RAND()<0.5,1,0)","v":1},0,0,0,0,null,null,5,0,null,9,0]
[{"$f":"IF(RAND()<0.5,1,0)","v":0},1,1,0,1,0,0,0,1,0,0,0,0,0,1,0,0,0,1,1,null,null,4,0,null,7,0]
[0,1,1,1,1,1,0,0,0,0,1,0,0,1,1,0,0,0,1,0,null,null,5,0,null,9,0]
[1,0,1,0,1,1,1,1,1,0,0,1,0,1,0,0,0,0,0,0,null,null,7,1,null,9,0]
[0,1,0,0,0,1,0,1,1,0,0,1,0,1,0,1,0,0,0,1,null,null,4,0,null,8,0]
[0,1,0,0,0,1,1,1,0,0,0,1,1,0,0,1,1,0,1,1,null,null,4,0,null,10,0]
[0,0,0,1,0,0,0,0,0,1,0,0,0,0,0,1,0,1,1,0,null,null,2,0,null,5,0]
[1,0,1,1,0,1,0,1,1,1,0,1,1,0,0,0,1,1,0,1,null,null,7,1,null,12,1]
[0,0,0,1,0,1,0,1,1,1,1,0,0,1,0,1,0,0,1,0,null,null,5,0,null,9,0]
[0,0,1,0,0,0,0,1,0,1,1,1,1,1,1,0,1,0,1,0,null,null,3,0,null,10,0]
[0,1,1,1,0,1,0,1,0,1,1,1,1,1,0,0,0,1,1,0,null,null,6,1,null,12,1]
[1,0,0,1,1,1,0,1,0,0,0,1,1,0,1,1,1,0,1,1,null,null,5,0,null,12,1]
[0,1,0,0,0,1,0,1,0,1,0,0,1,1,1,1,1,1,0,0,null,null,4,0,null,10,0]
[0,0,0,1,0,0,1,0,1,0,1,1,0,0,1,0,0,0,1,1,null,null,3,0,null,8,0]
[1,1,0,0,1,0,0,0,1,1,1,1,1,1,1,0,1,0,0,1,null,null,5,0,null,12,1]
[0,0,1,0,1,1,1,1,0,0,1,0,1,0,0,0,0,1,0,1,null,null,5,0,null,9,0]
[1,0,1,0,0,0,1,0,0,1,1,1,1,0,1,{"$f":"IF(RAND()<0.5,1,0)","v":0},1,1,0,1,null,null,4,0,null,11,0]
[{"$f":"IF(RAND()<0.5,1,0)","v":0},1,1,1,1,0,1,1,1,0,0,1,1,1,1,1,0,1,0,0,null,null,7,1,null,13,1]
[1,0,1,1,0,0,1,1,1,0,0,1,1,1,1,1,0,1,0,0,null,null,6,1,null,12,1]
[0,0,0,1,0,1,1,0,1,1,0,0,0,0,0,0,1,0,1,0,null,null,5,0,null,7,0]
[1,1,1,1,1,1,1,0,1,1,0,0,1,1,0,0,1,0,1,0,null,null,9,1,null,13,1]
[0,0,1,0,1,0,1,1,1,0,1,1,0,0,1,1,0,0,1,1,null,null,5,0,null,11,0]
[1,1,1,0,1,1,1,0,1,0,1,0,1,1,0,0,0,1,0,1,null,null,7,1,null,12,1]
[1,0,1,0,0,1,0,1,1,1,0,0,1,0,0,0,0,0,0,1,null,null,6,1,null,8,0]
[0,0,1,0,1,1,1,1,0,0,1,1,0,1,0,0,1,0,1,0,null,null,5,0,null,10,0]
[1,0,1,0,0,0,1,0,0,0,0,1,1,1,1,1,0,0,1,1,null,null,3,0,null,10,0]
[1,0,0,0,1,1,0,1,0,1,1,0,1,0,0,1,0,0,1,1,null,null,5,0,null,10,0]
[0,1,1,0,0,0,0,1,0,0,0,0,0,0,1,1,0,0,1,1,null,null,3,0,null,7,0]
[0,0,1,1,1,0,0,1,0,0,1,1,1,1,1,1,0,0,0,0,null,null,4,0,null,10,0]
[0,1,1,0,0,0,0,0,1,0,0,0,0,0,0,1,1,1,1,0,null,null,3,0,null,7,0]
[0,1,1,1,0,1,0,1,1,0,0,0,0,1,1,0,1,0,0,1,null,null,6,1,null,10,0]
[0,0,0,0,1,0,1,0,1,1,0,0,1,1,0,1,0,1,0,0,null,null,4,0,null,8,0]
[0,1,1,0,1,1,0,1,1,1,1,1,0,1,0,{"$f":"IF(RAND()<0.5,1,0)","v":1},1,1,1,0,null,null,7,1,null,14,1]
[{"$f":"IF(RAND()<0.5,1,0)","v":1},1,0,0,1,1,1,1,0,1,1,0,0,1,0,0,0,1,1,1,null,null,7,1,null,12,1]
[0,0,1,0,0,0,1,0,1,0,0,0,0,1,0,0,1,1,0,0,null,null,3,0,null,6,0]
[1,0,0,0,1,1,1,0,0,0,0,1,1,0,0,0,0,0,0,0,null,null,4,0,null,6,0]
[1,0,1,0,0,1,1,1,1,1,1,0,0,0,1,1,1,0,0,0,null,null,{"$f":"SUM(A899:J899)","v":7},{"$f":"IF(W899>=6,1,0)","v":1},null,{"$f":"SUM(A899:T899)","v":11},{"$f":"IF(Z899>=12,1,0)","v":0}]
[1,1,0,1,1,0,1,0,1,0,0,0,1,1,1,0,1,0,1,0,null,null,6,1,null,11,0]
[0,0,0,1,1,0,0,1,0,1,0,0,1,1,0,1,1,1,1,0,null,null,4,0,null,10,0]
[0,1,0,0,1,0,0,0,0,0,1,0,0,1,1,0,1,0,0,1,null,null,2,0,null,7,0]
[0,0,0,0,0,0,1,1,0,0,0,1,0,0,0,0,0,1,1,0,null,null,2,0,null,5,0]
[1,1,0,0,1,0,1,1,0,1,0,1,0,0,1,0,1,0,1,0,null,null,6,1,null,10,0]
[1,0,0,1,0,0,1,0,1,1,1,1,1,1,1,0,1,1,0,1,null,null,5,0,null,13,1]
[0,0,1,1,1,1,0,1,0,1,1,1,1,1,1,0,0,1,0,0,null,null,6,1,null,12,1]
[0,1,1,0,0,1,1,1,1,1,0,0,1,1,1,1,1,0,1,0,null,null,7,1,null,13,1]
[0,0,0,1,1,1,0,1,0,1,1,0,1,1,1,1,1,0,0,1,null,null,5,0,null,12,1]
[1,1,0,0,1,1,1,1,1,1,0,0,1,0,1,0,0,0,1,0,null,null,8,1,null,11,0]
[0,0,1,0,1,1,1,0,1,0,0,0,1,0,1,0,1,0,1,1,null,null,5,0,null,10,0]
[0,0,0,1,1,0,0,0,0,1,0,1,0,1,0,{"$f":"IF(RAND()<0.5,1,0)","v":1},1,0,0,0,null,null,3,0,null,7,0]
[{"$f":"IF(RAND()<0.5,1,0)","v":0},1,0,1,0,0,0,0,0,0,0,1,0,1,0,1,0,0,0,1,null,null,2,0,null,6,0]
[0,1,0,0,0,0,1,1,1,0,0,1,1,0,1,0,0,1,1,0,null,null,4,0,null,9,0]
[1,0,0,1,0,1,0,0,1,0,1,1,1,0,1,1,1,1,0,1,null,null,4,0,null,12,1]
[0,1,1,1,0,1,1,0,1,0,1,0,0,1,1,1,1,0,1,1,null,null,6,1,null,13,1]
[0,1,1,1,1,0,0,0,1,0,0,1,1,1,1,0,0,1,1,0,null,null,5,0,null,11,0]
[1,1,0,1,0,1,0,0,0,0,1,1,1,0,0,0,0,1,0,1,null,null,4,0,null,9,0]
[1,1,0,1,1,0,0,1,0,1,0,1,0,0,0,0,0,1,0,0,null,null,6,1,null,8,0]
[1,0,1,0,1,1,0,1,0,1,0,0,1,1,1,1,0,1,1,1,null,null,6,1,null,13,1]
[0,0,0,1,1,0,0,0,0,0,1,0,1,1,0,1,1,1,0,1,null,null,2,0,null,9,0]
[1,0,1,0,0,0,1,0,0,1,1,0,0,0,1,0,1,0,0,1,null,null,4,0,null,8,0]
[1,1,1,0,1,0,1,0,1,0,1,1,0,0,1,0,0,1,1,1,null,null,6,1,null,12,1]
[1,0,0,0,0,0,1,0,1,0,1,1,1,0,0,0,1,1,0,0,null,null,3,0,null,8,0]
[1,1,0,0,1,1,0,1,0,0,0,1,0,1,0,1,0,1,0,1,null,null,5,0,null,10,0]
[0,1,1,0,0,1,1,0,1,0,1,0,0,1,0,0,1,0,0,1,null,null,5,0,null,9,0]
[0,1,0,0,1,1,0,1,0,1,1,1,1,0,1,0,0,1,1,0,null,null,5,0,null,11,0]
[1,1,1,0,1,0,1,0,1,1,0,1,0,0,1,{"$f":"IF(RAND()<0.5,1,0)","v":1},0,1,0,1,null,null,7,1,null,12,1]
[{"$f":"IF(RAND()<0.5,1,0)","v":0},1,0,0,0,0,1,0,1,0,0,1,0,0,1,0,0,0,1,0,null,null,3,0,null,6,0]
[0,0,1,1,0,1,0,1,0,0,1,1,0,1,1,0,0,0,0,1,null,null,4,0,null,9,0]
[1,1,1,0,1,1,1,0,0,0,0,0,1,0,1,1,0,0,0,1,null,null,6,1,null,10,0]
[0,1,1,0,0,1,0,1,1,1,1,1,0,1,1,0,0,0,1,1,null,null,6,1,null,12,1]
[1,0,0,1,0,1,1,0,0,0,1,0,1,1,0,1,1,1,0,1,null,null,4,0,null,11,0]
[1,1,0,1,0,1,1,1,1,0,0,0,0,0,1,0,1,0,1,0,null,null,7,1,null,10,0]
[1,0,0,1,1,0,1,1,1,0,0,0,1,1,1,0,0,1,0,0,null,null,6,1,null,10,0]
[1,0,1,0,0,0,1,0,1,0,1,0,0,0,1,0,1,1,1,0,null,null,4,0,null,9,0]
[0,0,1,1,0,1,0,0,1,0,1,1,0,0,1,0,0,0,1,1,null,null,4,0,null,9,0]
[0,0,0,1,0,0,1,0,1,0,1,1,1,0,0,0,1,1,1,0,null,null,3,0,null,9,0]
[1,0,1,0,1,1,1,1,1,1,1,0,1,1,1,1,1,1,1,1,null,null,8,1,null,17,1]
[1,0,0,1,0,1,0,0,1,0,0,1,0,1,1,1,0,1,0,0,null,null,4,0,null,9,0]
[1,1,1,0,1,1,0,0,0,0,1,0,0,1,0,1,0,1,1,0,null,null,5,0,null,10,0]
[1,1,1,0,1,0,0,1,0,1,1,0,0,1,1,1,0,0,0,1,null,null,6,1,null,11,0]
[0,1,1,1,1,0,1,0,1,0,1,0,1,1,0,0,0,1,0,1,null,null,6,1,null,11,0]
[1,0,1,0,0,1,0,1,0,1,1,0,1,1,0,{"$f":"IF(RAND()<0.5,1,0)","v":0},0,1,1,1,null,null,5,0,null,11,0]
[{"$f":"IF(RAND()<0.5,1,0)","v":1},0,1,0,1,0,1,0,1,1,1,0,1,0,1,1,1,1,0,0,null,null,6,1,null,12,1]
[1,0,1,1,1,0,0,1,1,1,1,1,1,0,1,1,0,1,0,1,null,null,7,1,null,14,1]
[0,0,0,1,1,0,0,1,0,0,1,1,1,1,0,0,0,1,0,1,null,null,3,0,null,9,0]
[1,0,1,0,0,0,1,0,0,1,0,1,1,0,1,0,0,0,1,1,null,null,4,0,null,9,0]
[1,0,0,0,0,1,0,1,1,1,0,1,1,1,1,0,0,0,1,1,null,null,5,0,null,11,0]
[0,1,0,1,0,0,1,0,0,1,1,0,0,1,1,0,0,1,1,0,null,null,4,0,null,9,0]
[1,0,0,0,0,0,1,1,1,1,1,0,0,0,0,0,0,1,1,1,null,null,5,0,null,9,0]
[0,1,0,1,1,0,1,0,0,1,0,1,1,0,0,1,0,0,0,0,null,null,5,0,null,8,0]
[1,0,0,0,0,0,1,1,0,0,0,0,1,1,0,1,1,0,0,1,null,null,3,0,null,8,0]
[1,1,0,0,0,1,1,1,1,1,1,0,1,1,0,1,0,0,1,1,null,null,7,1,null,13,1]
[1,1,0,1,1,0,0,1,0,0,1,0,0,1,0,1,1,1,0,1,null,null,5,0,null,11,0]
[0,1,1,0,0,0,1,1,0,0,0,0,1,1,1,0,1,1,1,1,null,null,4,0,null,11,0]
[0,0,0,0,1,1,1,1,1,0,0,1,0,1,0,0,0,0,1,0,null,null,5,0,null,8,0]
[0,1,0,1,1,1,0,0,0,1,0,1,0,1,0,1,1,1,1,1,null,null,5,0,null,12,1]
[0,0,1,0,1,0,1,1,0,0,1,1,0,1,0,1,1,0,0,0,null,null,4,0,null,9,0]
[0,1,1,0,0,1,0,0,0,1,1,0,0,0,1,{"$f":"IF(RAND()<0.5,1,0)","v":0},1,0,1,0,null,null,4,0,null,8,0]
[{"$f":"IF(RAND()<0.5,1,0)","v":1},1,0,1,1,1,0,1,0,0,0,1,1,0,0,0,1,1,1,1,null,null,6,1,null,12,1]
[0,1,1,0,1,0,0,0,0,0,1,0,1,0,0,1,1,1,1,1,null,null,3,0,null,10,0]
[1,0,0,1,1,1,1,0,0,0,1,0,0,0,0,1,0,1,1,1,null,null,5,0,null,10,0]
[1,0,0,1,0,1,1,1,0,1,1,1,0,0,0,0,1,0,0,1,null,null,{"$f":"SUM(A963:J963)","v":6},{"$f":"IF(W963>=6,1,0)","v":1},null,{"$f":"SUM(A963:T963)","v":10},{"$f":"IF(Z963>=12,1,0)","v":0}]
[1,1,0,0,0,1,0,1,1,0,1,0,0,1,0,1,1,0,1,0,null,null,5,0,null,10,0]
[1,0,1,0,0,0,0,1,0,1,1,1,1,0,1,1,1,0,0,1,null,null,4,0,null,11,0]
[1,0,0,0,0,0,0,1,1,1,0,0,1,1,0,0,1,0,1,0,null,null,4,0,null,8,0]
[1,0,0,0,0,0,0,0,0,0,0,0,1,0,0,0,0,0,0,0,null,null,1,0,null,2,0]
[0,0,1,1,1,0,0,1,0,1,1,1,0,1,1,0,0,0,0,1,null,null,5,0,null,10,0]
[0,1,0,0,0,1,0,0,0,0,1,1,1,0,1,1,1,1,1,0,null,null,2,0,null,10,0]
[0,1,0,0,0,1,0,0,0,1,1,1,1,1,0,1,0,0,1,0,null,null,3,0,null,9,0]
[1,1,0,0,0,1,0,1,0,1,0,1,1,1,0,1,1,0,0,0,null,null,5,0,null,10,0]
[1,1,0,0,0,1,0,1,0,1,0,0,0,1,0,1,1,1,0,0,null,null,5,0,null,9,0]
[1,1,1,1,0,0,1,0,0,0,0,0,0,1,0,0,0,0,0,1,null,null,5,0,null,7,0]
[0,1,1,1,0,0,0,1,0,0,1,0,1,1,0,1,1,1,1,1,null,null,4,0,null,12,1]
[0,0,0,0,1,0,0,1,0,1,0,1,1,0,1,{"$f":"IF(RAND()<0.5,1,0)","v":1},0,1,1,0,null,null,3,0,null,9,0]
[{"$f":"IF(RAND()<0.5,1,0)","v":0},0,1,0,1,0,0,0,0,1,0,0,0,0,0,1,0,0,0,0,null,null,3,0,null,4,0]
[0,0,1,1,0,1,1,0,1,0,1,1,1,0,0,0,0,1,1,1,null,null,5,0,null,11,0]
[0,1,0,1,0,0,1,0,0,0,1,1,1,0,0,0,0,1,1,1,null,null,3,0,null,9,0]
[1,1,1,0,1,1,1,1,1,1,0,1,1,1,1,1,0,1,0,0,null,null,9,1,null,15,1]
[0,0,0,0,0,0,1,1,0,1,0,1,0,1,1,0,0,0,1,0,null,null,3,0,null,7,0]
[1,1,1,0,1,0,1,1,1,0,1,0,0,1,1,1,1,0,0,1,null,null,7,1,null,13,1]
[1,1,0,1,0,1,1,1,1,1,0,1,0,1,0,1,1,1,0,1,null,null,8,1,null,14,1]
[1,1,0,1,0,1,1,0,1,0,1,0,1,1,0,0,0,0,1,1,null,null,6,1,null,11,0]
[0,0,1,1,0,0,0,1,0,1,0,1,1,1,0,1,1,0,1,0,null,null,4,0,null,10,0]
[1,0,0,0,0,0,1,0,0,1,0,0,1,0,1,0,0,1,1,1,null,null,3,0,null,8,0]
[1,1,0,0,0,1,0,0,1,0,0,1,1,0,1,1,0,1,0,0,null,null,4,0,null,9,0]
[0,0,0,1,1,0,0,0,1,0,0,1,0,0,0,1,1,1,0,0,null,null,3,0,null,7,0]
[1,0,0,0,0,1,0,0,0,1,1,1,0,0,1,1,1,0,0,0,null,null,3,0,null,8,0]
[1,1,0,0,1,1,0,1,0,0,0,0,1,1,1,1,0,1,0,0,null,null,5,0,null,10,0]
[1,0,1,0,1,0,0,1,0,0,1,0,1,0,0,0,0,0,0,0,null,null,4,0,null,6,0]
[0,1,0,1,0,0,1,0,0,0,1,1,0,1,0,{"$f":"IF(RAND()<0.5,1,0)","v":1},1,0,0,1,null,null,3,0,null,9,0]
[{"$f":"IF(RAND()<0.5,1,0)","v":1},1,1,1,1,0,0,0,0,0,1,1,1,1,1,1,0,1,0,0,null,null,5,0,null,12,1]
[1,1,1,0,1,0,0,1,1,1,0,0,1,0,0,0,0,0,1,0,null,null,7,1,null,9,0]
[0,0,1,0,1,1,1,0,0,0,1,1,0,1,1,0,0,0,0,0,null,null,4,0,null,8,0]
[1,0,0,0,1,1,0,1,0,1,0,0,1,0,1,0,0,1,1,1,null,null,5,0,null,10,0]
[1,0,1,1,1,1,1,1,1,0,1,0,1,0,1,0,1,0,1,1,null,null,8,1,null,14,1]
[1,0,0,0,0,0,0,1,1,0,0,0,0,1,1,0,1,0,1,1,null,null,3,0,null,8,0]
[1,1,1,0,0,0,0,1,0,1,0,1,0,0,1,0,1,1,1,0,null,null,5,0,null,10,0]
[1,0,1,0,0,1,1,0,0,0,0,1,1,1,0,1,0,1,1,1,null,null,4,0,null,11,0]
[0,0,1,0,1,0,0,0,0,1,0,0,0,0,1,1,1,0,0,0,null,null,3,0,null,6,0]
[1,1,1,0,1,1,0,0,1,0,0,0,0,0,0,0,1,0,0,0,null,null,6,1,null,7,0]

{"sheet":"problema dadi","index":3,"n_rows":1001,"n_cols":17,"rows_kept":1001,"cut":false,"hidden":false,"merged":[]}
[null,null,null,null,null,null,null,null,null,null,null,null,null,null,46]
[{"$f":"INT(RAND()*6+1)","v":3},{"$f":"INT(RAND()*6+1)","v":1},{"$f":"INT(RAND()*6+1)","v":5},{"$f":"INT(RAND()*6+1)","v":4},{"$f":"INT(RAND()*6+1)","v":5},{"$f":"INT(RAND()*6+1)","v":5},5,1,4,3,null,{"$f":"SUM(A2:E2)","v":18},{"$f":"IF(L2>=25,1,0)","v":0},{"$f":"SUM(M:M)","v":30},{"$f":"SUM(A2:J2)","v":36},{"$f":"IF(O2>=O$1,1,0)","v":0},{"$f":"SUM(P:P)","v":21}]
[{"$f":"INT(RAND()*6+1)","v":2},4,5,4,5,1,4,5,2,5,null,{"$f":"SUM(A3:E3)","v":20},{"$f":"IF(L3>=25,1,0)","v":0},null,{"$f":"SUM(A3:J3)","v":37},{"$f":"IF(O3>=O$1,1,0)","v":0}]
[1,6,1,6,4,3,6,4,5,3,null,18,0,null,39,0]
[1,5,6,1,1,3,3,2,4,2,null,14,0,null,28,0]
[1,2,5,1,6,1,5,6,3,1,null,15,0,null,31,0]
[5,5,4,1,3,4,4,5,1,2,null,18,0,null,34,0]
[6,2,4,6,1,6,5,6,5,2,null,19,0,null,43,0]
[4,4,5,3,4,5,2,2,1,1,null,20,0,null,31,0]
[6,3,3,6,1,2,5,5,3,5,null,19,0,null,39,0]
[4,1,2,3,3,4,2,4,2,5,null,13,0,null,30,0]
[3,6,4,3,3,1,2,6,2,4,null,19,0,null,34,0]
[2,6,5,2,4,5,6,5,5,4,null,19,0,null,44,0]
[2,5,5,1,2,1,1,2,4,2,null,15,0,null,25,0]
[6,1,6,1,4,5,3,3,6,3,null,18,0,null,38,0]
[3,4,6,3,2,4,3,5,3,2,null,18,0,null,35,0]
[4,2,3,4,4,4,3,5,2,6,null,17,0,null,37,0]
[6,2,5,4,3,6,1,1,2,6,null,20,0,null,36,0]
[2,5,2,2,6,4,4,5,5,6,null,17,0,null,41,0]
[2,4,1,4,6,1,4,1,4,5,null,17,0,null,32,0]
[3,3,3,5,1,1,5,4,3,4,null,15,0,null,32,0]
[3,6,2,5,2,1,3,4,2,3,null,18,0,null,31,0]
[2,4,1,1,1,1,4,4,2,1,null,9,0,null,21,0]
[2,5,2,1,2,3,1,2,5,4,null,12,0,null,27,0]
[5,1,1,2,1,3,5,6,3,1,null,10,0,null,28,0]
[4,1,2,4,1,5,5,6,4,2,null,12,0,null,34,0]
[5,4,1,4,5,1,5,3,6,1,null,19,0,null,35,0]
[6,2,3,1,1,6,1,6,4,6,null,13,0,null,36,0]
[1,5,2,2,3,2,3,4,5,4,null,13,0,null,31,0]
[1,1,1,6,5,4,5,1,1,1,null,14,0,null,26,0]
[2,2,5,2,5,3,3,5,4,4,null,16,0,null,35,0]
[2,4,6,2,1,5,2,3,4,6,null,15,0,null,35,0]
[1,2,4,6,3,3,3,3,1,2,null,16,0,null,28,0]
[3,4,4,3,3,5,1,3,5,1,null,17,0,null,32,0]
[4,1,3,6,5,1,4,1,5,5,null,19,0,null,35,0]
[{"$f":"INT(RAND()*6+1)","v":5},1,2,1,6,5,1,2,2,6,null,15,0,null,31,0]
[5,1,5,2,6,4,5,2,4,4,null,19,0,null,38,0]
[4,1,3,6,4,2,3,3,4,3,null,18,0,null,33,0]
[2,2,5,1,3,5,6,6,4,3,null,13,0,null,37,0]
[3,1,3,1,6,3,5,3,2,5,null,14,0,null,32,0]
[1,5,3,4,3,2,3,2,3,5,null,16,0,null,31,0]
[2,3,1,3,2,6,2,6,1,6,null,11,0,null,32,0]
[1,5,1,2,1,5,5,1,1,3,null,10,0,null,25,0]
[5,4,1,6,1,3,1,3,4,3,null,17,0,null,31,0]
[6,5,4,1,6,2,6,2,5,3,null,22,0,null,40,0]
[2,5,2,1,2,6,4,3,5,1,null,12,0,null,31,0]
[2,2,1,5,1,2,4,4,6,5,null,11,0,null,32,0]
[6,5,3,1,5,1,4,2,1,4,null,20,0,null,32,0]
[1,4,2,6,2,1,2,2,2,4,null,15,0,null,26,0]
[5,5,3,2,5,3,4,2,2,6,null,20,0,null,37,0]
[3,1,6,6,1,1,6,4,6,3,null,17,0,null,37,0]
[6,1,2,3,4,6,3,2,2,2,null,16,0,null,31,0]
[2,4,5,6,6,3,1,5,4,3,null,23,0,null,39,0]
[4,3,4,1,2,2,3,5,5,6,null,14,0,null,35,0]
[3,3,1,1,6,2,4,5,1,4,null,14,0,null,30,0]
[2,3,5,6,6,6,5,6,3,6,null,22,0,null,48,1]
[4,1,1,6,3,6,6,6,3,1,null,15,0,null,37,0]
[3,1,4,3,2,3,5,6,3,5,null,13,0,null,35,0]
[6,5,2,1,4,4,3,1,4,6,null,18,0,null,36,0]
[4,5,4,2,3,6,4,2,6,5,null,18,0,null,41,0]
[4,3,2,1,6,{"$f":"INT(RAND()*6+1)","v":4},5,5,4,3,null,16,0,null,37,0]
[{"$f":"INT(RAND()*6+1)","v":2},3,2,4,6,5,5,4,3,2,null,17,0,null,36,0]
[4,3,6,1,5,6,3,4,6,3,null,19,0,null,41,0]
[4,5,4,1,5,1,2,3,4,2,null,19,0,null,31,0]
[3,3,5,3,1,1,5,5,2,5,null,15,0,null,33,0]
[3,3,3,3,3,3,6,4,3,1,null,15,0,null,32,0]
[3,3,3,5,5,2,1,5,3,5,null,{"$f":"SUM(A67:E67)","v":19},{"$f":"IF(L67>=25,1,0)","v":0},null,{"$f":"SUM(A67:J67)","v":35},{"$f":"IF(O67>=O$1,1,0)","v":0}]
[1,2,4,6,1,1,2,2,6,6,null,14,0,null,31,0]
[4,3,3,1,4,4,4,6,1,1,null,15,0,null,31,0]
[2,3,3,6,3,2,4,4,2,1,null,17,0,null,30,0]
[3,5,6,2,3,6,2,3,4,6,null,19,0,null,40,0]
[1,3,3,3,5,4,2,2,4,4,null,15,0,null,31,0]
[4,1,2,6,4,1,3,1,5,4,null,17,0,null,31,0]
[6,6,5,6,3,4,2,5,5,5,null,26,1,null,47,1]
[6,3,4,1,4,6,5,3,5,4,null,18,0,null,41,0]
[3,1,5,1,5,1,1,6,4,3,null,15,0,null,30,0]
[3,1,4,1,1,1,6,1,4,2,null,10,0,null,24,0]
[1,4,2,1,6,1,5,5,4,3,null,14,0,null,32,0]
[2,1,5,5,3,3,6,2,2,6,null,16,0,null,35,0]
[4,2,3,6,1,3,6,4,3,5,null,16,0,null,37,0]
[6,3,6,2,1,5,1,5,6,5,null,18,0,null,40,0]
[5,6,4,1,5,1,4,4,5,6,null,21,0,null,41,0]
[1,1,6,3,3,1,2,4,1,5,null,14,0,null,27,0]
[6,2,1,4,1,4,2,2,2,6,null,14,0,null,30,0]
[5,4,5,5,2,5,5,6,1,2,null,21,0,null,40,0]
[5,6,4,1,5,3,2,3,4,3,null,21,0,null,36,0]
[2,2,6,5,5,3,4,2,4,4,null,20,0,null,37,0]
[1,3,5,1,4,5,3,5,1,3,null,14,0,null,31,0]
[2,1,4,4,3,5,3,6,3,1,null,14,0,null,32,0]
[6,3,4,4,4,3,5,1,6,6,null,21,0,null,42,0]
[1,3,3,5,1,2,6,4,6,2,null,13,0,null,33,0]
[1,6,6,3,6,4,2,2,2,2,null,22,0,null,34,0]
[6,6,4,5,2,5,2,1,5,4,null,23,0,null,40,0]
[2,3,1,3,1,2,3,4,2,4,null,10,0,null,25,0]
[6,3,3,4,4,2,3,3,1,4,null,20,0,null,33,0]
[4,5,3,2,6,1,5,4,3,6,null,20,0,null,39,0]
[1,6,3,4,2,3,4,4,4,2,null,16,0,null,33,0]
[3,3,2,6,6,2,2,3,5,5,null,20,0,null,37,0]
[1,3,6,5,1,3,2,6,3,4,null,16,0,null,34,0]
[5,2,5,6,5,4,3,3,1,2,null,23,0,null,36,0]
[2,1,1,6,4,3,5,4,1,2,null,14,0,null,29,0]
[6,6,6,2,4,3,4,1,5,2,null,24,0,null,39,0]
[3,5,6,2,3,1,2,1,2,1,null,19,0,null,26,0]
[6,6,1,4,2,5,3,1,6,3,null,19,0,null,37,0]
[5,3,1,2,2,3,2,5,5,3,null,13,0,null,31,0]
[3,1,5,1,3,3,3,1,6,2,null,13,0,null,28,0]
[4,1,1,2,4,2,3,3,3,3,null,12,0,null,26,0]
[1,2,3,6,2,6,2,1,6,1,null,14,0,null,30,0]
[4,1,1,1,2,6,2,6,2,4,null,9,0,null,29,0]
[2,6,3,4,5,5,5,2,2,3,null,20,0,null,37,0]
[4,1,3,6,5,2,5,1,3,2,null,19,0,null,32,0]
[6,3,5,6,4,{"$f":"INT(RAND()*6+1)","v":5},6,4,3,1,null,24,0,null,43,0]
[{"$f":"INT(RAND()*6+1)","v":6},3,1,2,2,5,2,2,2,1,null,14,0,null,26,0]
[5,4,3,4,5,4,1,3,4,2,null,21,0,null,35,0]
[6,6,3,3,3,3,4,4,1,2,null,21,0,null,35,0]
[1,6,3,5,6,2,3,2,5,2,null,21,0,null,35,0]
[4,2,1,5,2,2,1,3,4,4,null,14,0,null,28,0]
[5,3,4,3,6,3,1,4,1,2,null,21,0,null,32,0]
[2,2,3,4,4,2,3,1,4,4,null,15,0,null,29,0]
[6,1,1,4,1,1,5,4,1,3,null,13,0,null,27,0]
[2,3,4,1,2,6,2,4,3,2,null,12,0,null,29,0]
[4,5,2,4,1,4,3,2,2,6,null,16,0,null,33,0]
[2,3,1,1,3,1,6,1,5,6,null,10,0,null,29,0]
[1,4,4,6,6,2,6,6,6,2,null,21,0,null,43,0]
[4,6,1,6,3,3,2,3,6,6,null,20,0,null,40,0]
[1,3,3,2,2,1,5,3,4,6,null,11,0,null,30,0]
[5,6,6,6,5,4,1,5,1,1,null,28,1,null,40,0]
[1,1,3,3,5,4,1,5,2,3,null,13,0,null,28,0]
[4,6,1,3,4,5,3,3,6,4,null,18,0,null,39,0]
[5,4,1,5,6,5,5,1,6,2,null,21,0,null,40,0]
[3,3,4,6,2,4,6,5,5,3,null,{"$f":"SUM(A131:E131)","v":18},{"$f":"IF(L131>=25,1,0)","v":0},null,{"$f":"SUM(A131:J131)","v":41},{"$f":"IF(O131>=O$1,1,0)","v":0}]
[2,6,5,3,6,5,2,5,6,2,null,22,0,null,42,0]
[6,6,4,6,4,3,4,4,1,3,null,26,1,null,41,0]
[2,5,5,3,4,5,1,3,4,3,null,19,0,null,35,0]
[2,2,2,1,2,3,4,1,6,4,null,9,0,null,27,0]
[5,2,4,2,3,1,3,3,1,1,null,16,0,null,25,0]
[6,6,5,4,4,4,3,2,5,1,null,25,1,null,40,0]
[5,2,5,3,3,1,1,5,1,3,null,18,0,null,29,0]
[5,1,6,5,4,6,2,5,3,3,null,21,0,null,40,0]
[2,1,1,2,3,6,2,5,5,5,null,9,0,null,32,0]
[3,1,3,6,5,3,2,3,5,4,null,18,0,null,35,0]
[4,2,6,1,4,4,4,3,1,6,null,17,0,null,35,0]
[2,3,6,3,1,3,3,4,6,3,null,15,0,null,34,0]
[5,5,6,1,2,1,6,3,2,1,null,19,0,null,32,0]
[3,6,3,4,6,2,5,5,3,3,null,22,0,null,40,0]
[4,6,2,1,3,2,3,4,1,1,null,16,0,null,27,0]
[3,5,3,6,5,5,1,6,2,3,null,22,0,null,39,0]
[6,5,6,4,4,5,5,2,2,6,null,25,1,null,45,0]
[1,2,6,5,6,4,5,6,3,6,null,20,0,null,44,0]
[4,4,1,5,6,3,6,2,1,1,null,20,0,null,33,0]
[1,1,1,6,1,1,4,6,2,1,null,10,0,null,24,0]
[3,2,5,1,5,2,3,2,5,2,null,16,0,null,30,0]
[3,2,3,1,5,2,1,3,6,5,null,14,0,null,31,0]
[6,3,1,6,3,4,1,3,4,2,null,19,0,null,33,0]
[5,1,2,2,4,6,4,3,3,3,null,14,0,null,33,0]
[2,2,4,6,3,6,1,3,3,3,null,17,0,null,33,0]
[4,2,6,3,5,2,3,1,5,2,null,20,0,null,33,0]
[3,1,1,2,5,5,4,6,2,1,null,12,0,null,30,0]
[5,1,3,2,1,4,5,5,3,1,null,12,0,null,30,0]
[4,4,2,2,2,1,6,4,6,5,null,14,0,null,36,0]
[5,2,1,4,6,6,1,1,1,6,null,18,0,null,33,0]
[2,1,2,4,5,3,3,3,1,3,null,14,0,null,27,0]
[4,6,3,1,2,{"$f":"INT(RAND()*6+1)","v":4},1,4,6,1,null,16,0,null,32,0]
[{"$f":"INT(RAND()*6+1)","v":4},4,3,6,5,3,2,3,1,4,null,22,0,null,35,0]
[4,1,1,3,2,4,3,4,1,6,null,11,0,null,29,0]
[1,4,2,3,5,6,1,1,1,2,null,15,0,null,26,0]
[4,5,4,5,4,6,4,4,6,3,null,22,0,null,45,0]
[6,4,1,1,4,4,2,1,3,1,null,16,0,null,27,0]
[2,2,1,2,5,5,1,1,4,5,null,12,0,null,28,0]
[6,3,1,4,6,3,4,6,3,1,null,20,0,null,37,0]
[5,6,6,4,5,3,1,3,1,6,null,26,1,null,40,0]
[5,3,1,2,6,6,1,2,2,3,null,17,0,null,31,0]
[2,5,1,4,1,2,5,2,3,2,null,13,0,null,27,0]
[6,2,2,2,2,1,5,4,2,6,null,14,0,null,32,0]
[4,3,5,3,3,3,1,1,3,2,null,18,0,null,28,0]
[1,3,2,5,1,5,1,5,1,6,null,12,0,null,30,0]
[2,3,4,6,4,1,1,3,5,4,null,19,0,null,33,0]
[3,3,5,5,2,5,2,1,6,3,null,18,0,null,35,0]
[1,5,3,2,1,3,4,4,1,6,null,12,0,null,30,0]
[6,6,5,1,1,5,3,3,4,2,null,19,0,null,36,0]
[5,6,3,5,6,6,4,2,2,4,null,25,1,null,43,0]
[6,5,3,1,5,2,4,6,2,5,null,20,0,null,39,0]
[3,6,2,2,3,6,4,6,6,5,null,16,0,null,43,0]
[1,1,1,4,2,4,4,6,3,6,null,9,0,null,32,0]
[4,6,6,2,6,1,2,1,1,1,null,24,0,null,30,0]
[5,6,5,3,1,5,5,6,5,4,null,20,0,null,45,0]
[6,5,4,1,6,1,6,3,1,5,null,22,0,null,38,0]
[3,4,3,3,2,3,5,6,4,6,null,15,0,null,39,0]
[4,2,5,5,3,4,4,1,2,3,null,19,0,null,33,0]
[1,3,5,2,5,1,2,3,5,4,null,16,0,null,31,0]
[6,1,1,1,1,2,6,6,1,4,null,10,0,null,29,0]
[6,1,3,3,1,2,1,2,6,6,null,14,0,null,31,0]
[1,1,5,3,6,1,6,3,1,4,null,16,0,null,31,0]
[3,6,2,6,5,3,2,3,4,5,null,22,0,null,39,0]
[2,1,1,6,5,5,6,2,6,1,null,{"$f":"SUM(A195:E195)","v":15},{"$f":"IF(L195>=25,1,0)","v":0},null,{"$f":"SUM(A195:J195)","v":35},{"$f":"IF(O195>=O$1,1,0)","v":0}]
[2,1,5,6,1,1,5,4,6,1,null,15,0,null,32,0]
[4,4,6,6,5,2,6,6,1,5,null,25,1,null,45,0]
[1,3,6,2,2,3,5,3,5,2,null,14,0,null,32,0]
[3,4,4,6,3,2,4,1,1,1,null,20,0,null,29,0]
[1,4,6,6,4,6,4,3,5,5,null,21,0,null,44,0]
[2,5,3,4,5,2,1,2,4,2,null,19,0,null,30,0]
[5,4,5,5,5,6,2,2,2,4,null,24,0,null,40,0]
[5,6,6,5,4,6,5,4,6,2,null,26,1,null,49,1]
[3,1,3,2,6,2,3,4,6,4,null,15,0,null,34,0]
[3,1,1,2,1,1,5,1,6,4,null,8,0,null,25,0]
[4,2,4,3,2,4,4,1,6,1,null,15,0,null,31,0]
[1,3,2,2,2,3,5,3,2,6,null,10,0,null,29,0]
[5,6,1,5,1,5,4,5,4,1,null,18,0,null,37,0]
[4,4,3,2,5,2,6,3,1,6,null,18,0,null,36,0]
[1,4,4,6,1,3,3,4,6,2,null,16,0,null,34,0]
[1,6,5,2,1,2,3,2,6,4,null,15,0,null,32,0]
[2,3,2,1,6,6,1,5,5,2,null,14,0,null,33,0]
[3,4,6,5,1,6,6,1,6,4,null,19,0,null,42,0]
[5,3,6,6,3,{"$f":"INT(RAND()*6+1)","v":3},1,3,2,3,null,23,0,null,35,0]
[{"$f":"INT(RAND()*6+1)","v":5},4,5,6,6,3,6,6,3,3,null,26,1,null,47,1]
[5,5,2,3,2,5,6,5,6,5,null,17,0,null,44,0]
[6,2,1,6,2,1,1,2,5,1,null,17,0,null,27,0]
[5,4,5,3,3,2,2,1,5,3,null,20,0,null,33,0]
[2,4,4,4,2,6,4,4,3,1,null,16,0,null,34,0]
[4,1,5,5,1,1,4,4,1,1,null,16,0,null,27,0]
[4,6,2,5,4,1,3,6,1,5,null,21,0,null,37,0]
[3,5,1,3,2,6,2,5,2,4,null,14,0,null,33,0]
[3,5,4,6,1,5,2,1,5,6,null,19,0,null,38,0]
[5,4,6,2,2,4,6,3,5,6,null,19,0,null,43,0]
[5,4,6,3,1,1,4,1,4,2,null,19,0,null,31,0]
[6,5,5,5,1,3,6,1,2,6,null,22,0,null,40,0]
[3,3,4,4,5,4,5,2,6,6,null,19,0,null,42,0]
[5,5,5,3,2,2,3,3,5,4,null,20,0,null,37,0]
[1,6,3,6,5,5,1,6,6,3,null,21,0,null,42,0]
[5,2,2,2,2,6,4,6,4,5,null,13,0,null,38,0]
[5,5,3,1,3,4,1,1,2,2,null,17,0,null,27,0]
[2,3,6,3,2,3,6,6,3,2,null,16,0,null,36,0]
[6,5,1,4,4,1,4,6,4,3,null,20,0,null,38,0]
[5,5,6,3,2,1,2,1,1,3,null,21,0,null,29,0]
[3,2,5,5,1,2,6,4,2,6,null,16,0,null,36,0]
[2,2,5,3,6,3,2,5,2,5,null,18,0,null,35,0]
[6,1,5,2,6,1,4,3,5,1,null,20,0,null,34,0]
[2,4,4,6,6,5,6,3,4,2,null,22,0,null,42,0]
[6,1,3,2,4,6,5,5,1,5,null,16,0,null,38,0]
[2,5,6,5,4,1,5,6,5,4,null,22,0,null,43,0]
[4,6,6,4,6,6,4,1,4,3,null,26,1,null,44,0]
[6,2,5,3,4,1,6,3,3,1,null,20,0,null,34,0]
[5,6,1,6,5,4,1,4,5,5,null,23,0,null,42,0]
[6,3,3,6,6,1,3,3,2,2,null,24,0,null,35,0]
[6,1,2,5,3,3,3,2,4,6,null,17,0,null,35,0]
[1,2,4,6,6,6,1,2,3,1,null,19,0,null,32,0]
[3,2,5,3,6,2,6,6,4,4,null,19,0,null,41,0]
[6,4,5,4,2,4,3,6,2,2,null,21,0,null,38,0]
[2,6,4,1,1,6,1,6,1,6,null,14,0,null,34,0]
[5,4,3,6,2,6,4,1,6,6,null,20,0,null,43,0]
[3,6,3,4,2,5,2,2,4,4,null,18,0,null,35,0]
[5,4,1,2,2,4,4,4,4,2,null,14,0,null,32,0]
[2,3,1,5,5,5,1,4,6,4,null,16,0,null,36,0]
[4,2,1,3,6,2,1,6,1,2,null,16,0,null,28,0]
[1,5,2,6,1,6,3,3,5,2,null,15,0,null,34,0]
[4,6,6,1,6,1,1,3,6,1,null,23,0,null,35,0]
[3,6,2,5,4,6,1,1,1,4,null,20,0,null,33,0]
[3,6,3,4,1,2,4,6,1,2,null,17,0,null,32,0]
[4,6,6,1,3,6,2,4,5,3,null,{"$f":"SUM(A259:E259)","v":20},{"$f":"IF(L259>=25,1,0)","v":0},null,{"$f":"SUM(A259:J259)","v":40},{"$f":"IF(O259>=O$1,1,0)","v":0}]
[4,3,2,6,4,3,5,5,1,3,null,19,0,null,36,0]
[1,4,4,6,4,2,5,3,2,2,null,19,0,null,33,0]
[1,2,5,3,4,2,5,6,1,1,null,15,0,null,30,0]
[1,2,5,2,6,5,6,1,1,6,null,16,0,null,35,0]
[6,2,3,6,5,2,2,1,4,6,null,22,0,null,37,0]
[1,2,4,2,3,{"$f":"INT(RAND()*6+1)","v":6},4,5,4,4,null,12,0,null,35,0]
[{"$f":"INT(RAND()*6+1)","v":4},2,2,4,6,2,4,2,1,3,null,18,0,null,30,0]
[4,4,2,2,6,6,6,4,5,4,null,18,0,null,43,0]
[2,6,4,5,1,1,3,2,4,3,null,18,0,null,31,0]
[3,4,6,3,5,4,4,6,3,4,null,21,0,null,42,0]
[6,6,2,4,6,2,6,4,5,5,null,24,0,null,46,1]
[5,3,5,3,2,5,2,4,5,4,null,18,0,null,38,0]
[1,6,5,1,4,1,5,4,3,5,null,17,0,null,35,0]
[3,1,2,2,6,2,6,6,3,1,null,14,0,null,32,0]
[1,5,6,6,5,5,3,3,3,6,null,23,0,null,43,0]
[2,3,4,5,4,2,3,6,2,3,null,18,0,null,34,0]
[6,5,2,3,4,4,1,6,3,2,null,20,0,null,36,0]
[3,4,4,5,3,5,5,1,5,2,null,19,0,null,37,0]
[5,1,3,1,5,3,3,1,6,6,null,15,0,null,34,0]
[5,6,1,4,3,3,3,3,6,4,null,19,0,null,38,0]
[5,4,2,3,5,5,2,6,2,3,null,19,0,null,37,0]
[2,6,1,2,1,2,4,3,6,4,null,12,0,null,31,0]
[2,1,4,2,1,2,4,1,1,2,null,10,0,null,20,0]
[2,6,4,6,5,6,1,1,6,2,null,23,0,null,39,0]
[5,3,6,4,2,3,6,6,1,1,null,20,0,null,37,0]
[3,2,4,5,2,2,5,6,5,6,null,16,0,null,40,0]
[2,4,6,5,5,1,5,1,2,5,null,22,0,null,36,0]
[5,4,1,4,6,2,5,6,4,2,null,20,0,null,39,0]
[4,2,1,1,2,3,6,5,2,5,null,10,0,null,31,0]
[5,2,6,3,6,4,2,1,3,5,null,22,0,null,37,0]
[2,5,2,3,6,1,6,2,2,2,null,18,0,null,31,0]
[3,5,3,5,3,5,3,1,5,3,null,19,0,null,36,0]
[1,1,1,1,4,6,6,1,1,2,null,8,0,null,24,0]
[1,3,4,5,2,2,2,1,1,4,null,15,0,null,25,0]
[6,2,4,5,3,6,5,5,2,6,null,20,0,null,44,0]
[6,3,4,3,2,5,4,6,4,1,null,18,0,null,38,0]
[2,3,6,2,1,1,4,5,1,2,null,14,0,null,27,0]
[4,6,5,2,5,3,6,3,3,1,null,22,0,null,38,0]
[5,2,1,6,6,6,2,2,6,1,null,20,0,null,37,0]
[4,3,1,4,5,2,5,6,6,1,null,17,0,null,37,0]
[4,2,5,5,2,6,6,3,3,1,null,18,0,null,37,0]
[6,4,5,3,3,1,5,2,2,3,null,21,0,null,34,0]
[4,2,2,5,3,5,2,5,3,6,null,16,0,null,37,0]
[1,3,5,1,3,2,5,5,6,4,null,13,0,null,35,0]
[1,6,5,5,1,3,6,5,4,5,null,18,0,null,41,0]
[2,3,2,6,3,1,6,6,4,3,null,16,0,null,36,0]
[4,4,1,2,5,1,4,6,2,6,null,16,0,null,35,0]
[3,5,5,6,3,2,3,5,4,4,null,22,0,null,40,0]
[3,6,2,4,2,5,4,1,3,2,null,17,0,null,32,0]
[6,5,3,1,3,3,2,1,1,1,null,18,0,null,26,0]
[1,3,6,6,4,5,3,1,6,1,null,20,0,null,36,0]
[1,3,3,5,4,2,2,2,1,1,null,16,0,null,24,0]
[5,3,4,2,4,1,1,3,4,4,null,18,0,null,31,0]
[6,1,4,3,2,1,3,2,4,2,null,16,0,null,28,0]
[6,1,1,3,4,6,1,6,2,5,null,15,0,null,35,0]
[2,3,4,4,4,1,3,4,5,3,null,17,0,null,33,0]
[2,5,3,3,1,{"$f":"INT(RAND()*6+1)","v":3},4,4,1,6,null,14,0,null,32,0]
[{"$f":"INT(RAND()*6+1)","v":4},5,1,1,4,2,4,3,6,1,null,15,0,null,31,0]
[4,1,5,5,2,6,4,4,1,3,null,17,0,null,35,0]
[4,4,2,6,4,4,3,1,3,6,null,20,0,null,37,0]
[1,4,3,6,4,1,4,5,5,1,null,18,0,null,34,0]
[1,4,4,2,1,6,3,2,4,2,null,12,0,null,29,0]
[2,6,2,4,2,4,6,4,6,1,null,16,0,null,37,0]
[2,5,1,6,3,3,2,4,1,2,null,{"$f":"SUM(A323:E323)","v":17},{"$f":"IF(L323>=25,1,0)","v":0},null,{"$f":"SUM(A323:J323)","v":29},{"$f":"IF(O323>=O$1,1,0)","v":0}]
[2,6,2,3,4,5,6,1,4,1,null,17,0,null,34,0]
[3,1,3,4,6,1,4,4,1,1,null,17,0,null,28,0]
[4,4,5,1,3,2,4,2,5,1,null,17,0,null,31,0]
[4,1,1,6,6,6,4,5,3,2,null,18,0,null,38,0]
[6,6,6,4,5,6,5,1,2,4,null,27,1,null,45,0]
[2,6,5,5,5,2,5,1,3,2,null,23,0,null,36,0]
[2,3,1,3,6,2,3,4,6,2,null,15,0,null,32,0]
[4,5,3,5,5,6,2,6,3,3,null,22,0,null,42,0]
[5,5,3,3,3,5,4,1,4,3,null,19,0,null,36,0]
[4,1,6,5,1,5,4,5,5,6,null,17,0,null,42,0]
[3,5,4,6,4,5,2,5,3,4,null,22,0,null,41,0]
[5,6,1,6,1,1,3,3,2,4,null,19,0,null,32,0]
[3,1,6,6,3,6,2,6,5,4,null,19,0,null,42,0]
[6,4,5,2,5,3,4,3,5,3,null,22,0,null,40,0]
[6,6,2,5,4,2,3,5,2,1,null,23,0,null,36,0]
[4,6,4,2,6,3,3,3,6,2,null,22,0,null,39,0]
[3,1,4,2,6,2,4,2,6,6,null,16,0,null,36,0]
[1,6,6,6,3,1,3,1,2,2,null,22,0,null,31,0]
[3,6,2,1,6,1,6,3,6,4,null,18,0,null,38,0]
[3,6,3,5,1,1,6,5,1,3,null,18,0,null,34,0]
[4,3,1,1,3,5,4,2,2,4,null,12,0,null,29,0]
[5,5,6,4,1,1,4,2,6,6,null,21,0,null,40,0]
[5,5,4,2,2,6,5,3,3,5,null,18,0,null,40,0]
[1,5,3,1,2,6,2,6,1,1,null,12,0,null,28,0]
[6,2,2,3,5,1,6,2,3,2,null,18,0,null,32,0]
[5,3,4,5,1,3,2,1,4,5,null,18,0,null,33,0]
[6,4,4,2,2,3,1,3,1,5,null,18,0,null,31,0]
[3,3,1,3,5,1,1,5,2,5,null,15,0,null,29,0]
[5,1,3,3,3,3,2,1,2,4,null,15,0,null,27,0]
[5,2,1,2,4,5,4,1,6,5,null,14,0,null,35,0]
[3,1,1,5,2,2,5,2,4,2,null,12,0,null,27,0]
[4,1,3,4,5,1,4,4,1,3,null,17,0,null,30,0]
[1,6,4,3,4,3,4,2,6,5,null,18,0,null,38,0]
[6,5,4,4,3,3,4,1,5,1,null,22,0,null,36,0]
[6,6,6,3,3,5,4,1,3,5,null,24,0,null,42,0]
[1,3,1,6,1,5,2,1,5,2,null,12,0,null,27,0]
[2,2,3,5,1,3,2,6,4,5,null,13,0,null,33,0]
[6,6,2,6,4,6,4,4,4,6,null,24,0,null,48,1]
[2,2,4,4,4,3,2,5,4,5,null,16,0,null,35,0]
[4,6,1,4,2,3,6,1,1,1,null,17,0,null,29,0]
[6,2,6,3,2,5,4,1,6,1,null,19,0,null,36,0]
[5,6,1,2,6,2,5,6,1,2,null,20,0,null,36,0]
[3,5,4,4,1,6,2,1,1,3,null,17,0,null,30,0]
[2,3,1,1,3,{"$f":"INT(RAND()*6+1)","v":5},5,2,2,4,null,10,0,null,28,0]
[{"$f":"INT(RAND()*6+1)","v":3},2,6,5,1,2,3,1,6,4,null,17,0,null,33,0]
[2,4,3,2,3,1,4,4,6,5,null,14,0,null,34,0]
[4,5,6,4,2,6,1,1,4,5,null,21,0,null,38,0]
[6,6,4,2,4,1,5,6,6,1,null,22,0,null,41,0]
[1,5,4,3,4,2,5,3,5,5,null,17,0,null,37,0]
[4,5,2,2,1,3,4,3,1,1,null,14,0,null,26,0]
[4,2,2,4,5,4,1,4,6,3,null,17,0,null,35,0]
[5,4,2,6,3,4,4,3,4,2,null,20,0,null,37,0]
[2,1,4,4,1,4,3,2,2,5,null,12,0,null,28,0]
[4,2,4,6,1,6,5,6,1,2,null,17,0,null,37,0]
[4,4,5,2,6,5,5,2,5,6,null,21,0,null,44,0]
[2,2,1,3,6,4,2,2,3,5,null,14,0,null,30,0]
[1,3,2,3,4,1,4,6,4,3,null,13,0,null,31,0]
[1,5,6,6,3,4,3,6,5,3,null,21,0,null,42,0]
[6,4,2,5,6,5,2,3,2,3,null,23,0,null,38,0]
[5,5,6,5,5,1,2,2,4,6,null,26,1,null,41,0]
[6,2,2,6,1,1,4,3,5,4,null,17,0,null,34,0]
[3,3,2,1,5,1,1,1,2,3,null,14,0,null,22,0]
[2,3,3,4,5,6,3,1,4,1,null,17,0,null,32,0]
[3,2,1,1,2,3,2,6,4,3,null,{"$f":"SUM(A387:E387)","v":9},{"$f":"IF(L387>=25,1,0)","v":0},null,{"$f":"SUM(A387:J387)","v":27},{"$f":"IF(O387>=O$1,1,0)","v":0}]
[4,2,5,4,5,5,2,1,3,3,null,20,0,null,34,0]
[4,6,1,2,6,6,6,2,3,5,null,19,0,null,41,0]
[5,6,2,5,2,1,1,4,4,1,null,20,0,null,31,0]
[3,4,3,2,6,1,4,5,3,4,null,18,0,null,35,0]
[2,5,5,2,5,1,3,4,3,3,null,19,0,null,33,0]
[3,4,3,3,1,1,3,5,5,6,null,14,0,null,34,0]
[2,2,1,6,2,2,2,6,5,4,null,13,0,null,32,0]
[5,3,1,6,2,5,2,5,4,2,null,17,0,null,35,0]
[6,4,4,3,1,1,5,4,3,5,null,18,0,null,36,0]
[1,5,4,1,3,4,1,2,2,4,null,14,0,null,27,0]
[6,6,3,1,3,1,6,5,3,3,null,19,0,null,37,0]
[4,1,2,4,1,4,5,6,2,1,null,12,0,null,30,0]
[4,6,3,5,4,1,6,2,1,3,null,22,0,null,35,0]
[4,5,4,2,5,3,6,1,2,2,null,20,0,null,34,0]
[6,3,1,6,3,4,3,2,3,4,null,19,0,null,35,0]
[2,4,3,3,5,3,5,3,4,3,null,17,0,null,35,0]
[3,4,6,6,4,5,3,3,1,6,null,23,0,null,41,0]
[6,3,6,6,4,1,1,6,3,1,null,25,1,null,37,0]
[3,5,3,2,2,6,1,2,6,5,null,15,0,null,35,0]
[3,3,5,6,6,2,2,6,4,2,null,23,0,null,39,0]
[4,1,3,6,1,4,5,2,6,4,null,15,0,null,36,0]
[6,4,4,3,5,4,1,3,4,6,null,22,0,null,40,0]
[3,5,6,2,5,1,5,6,2,4,null,21,0,null,39,0]
[1,4,3,1,5,5,4,1,5,1,null,14,0,null,30,0]
[3,2,4,5,4,6,3,5,2,3,null,18,0,null,37,0]
[4,6,4,4,5,3,1,2,3,2,null,23,0,null,34,0]
[2,6,6,2,2,5,6,4,4,4,null,18,0,null,41,0]
[3,1,2,5,2,2,4,2,4,3,null,13,0,null,28,0]
[4,6,5,4,3,6,5,4,1,5,null,22,0,null,43,0]
[3,1,5,5,4,2,1,1,1,1,null,18,0,null,24,0]
[1,3,3,3,5,{"$f":"INT(RAND()*6+1)","v":4},1,6,5,1,null,15,0,null,32,0]
[{"$f":"INT(RAND()*6+1)","v":3},1,4,1,1,6,4,3,5,1,null,10,0,null,29,0]
[6,2,2,5,3,4,5,4,2,3,null,18,0,null,36,0]
[5,5,3,4,2,2,6,2,4,2,null,19,0,null,35,0]
[3,2,6,4,6,6,4,5,3,3,null,21,0,null,42,0]
[6,1,3,6,5,6,4,2,3,3,null,21,0,null,39,0]
[4,3,6,2,6,1,4,6,6,1,null,21,0,null,39,0]
[2,4,4,1,5,5,2,6,3,5,null,16,0,null,37,0]
[6,4,1,2,4,6,4,5,4,1,null,17,0,null,37,0]
[6,4,4,6,2,5,2,6,3,1,null,22,0,null,39,0]
[5,1,4,4,4,5,3,1,4,1,null,18,0,null,32,0]
[2,2,5,5,1,5,1,4,1,2,null,15,0,null,28,0]
[1,6,2,4,2,1,6,1,2,6,null,15,0,null,31,0]
[5,6,3,2,5,3,3,5,3,1,null,21,0,null,36,0]
[2,4,3,2,4,5,5,2,6,1,null,15,0,null,34,0]
[1,3,6,4,1,1,6,5,5,1,null,15,0,null,33,0]
[3,3,4,5,5,5,1,5,6,1,null,20,0,null,38,0]
[4,4,5,1,1,4,3,4,2,1,null,15,0,null,29,0]
[2,6,2,6,4,4,4,3,2,4,null,20,0,null,37,0]
[3,2,6,6,4,4,3,3,5,1,null,21,0,null,37,0]
[6,4,4,4,2,4,1,2,5,2,null,20,0,null,34,0]
[3,2,1,6,1,5,6,2,5,6,null,13,0,null,37,0]
[1,2,2,5,2,2,6,1,1,6,null,12,0,null,28,0]
[1,4,5,3,1,4,3,4,4,5,null,14,0,null,34,0]
[1,3,3,5,5,1,2,1,1,6,null,17,0,null,28,0]
[1,3,1,2,2,6,1,3,6,3,null,9,0,null,28,0]
[4,4,2,6,1,3,3,5,5,6,null,17,0,null,39,0]
[5,3,2,4,6,6,3,1,6,6,null,20,0,null,42,0]
[3,5,1,5,3,2,2,4,6,5,null,17,0,null,36,0]
[1,3,6,2,6,3,4,1,4,3,null,18,0,null,33,0]
[5,6,2,6,4,2,3,5,4,5,null,23,0,null,42,0]
[2,3,3,2,4,6,3,1,1,4,null,14,0,null,29,0]
[4,3,4,5,6,4,5,5,4,1,null,22,0,null,41,0]
[4,5,5,6,3,6,5,4,2,3,null,{"$f":"SUM(A451:E451)","v":23},{"$f":"IF(L451>=25,1,0)","v":0},null,{"$f":"SUM(A451:J451)","v":43},{"$f":"IF(O451>=O$1,1,0)","v":0}]
[6,2,5,5,6,2,3,6,6,1,null,24,0,null,42,0]
[5,6,3,2,3,6,6,2,5,2,null,19,0,null,40,0]
[6,6,1,3,5,2,3,3,2,6,null,21,0,null,37,0]
[2,3,4,2,6,6,1,1,1,1,null,17,0,null,27,0]
[4,3,6,2,6,2,5,3,3,1,null,21,0,null,35,0]
[6,3,3,4,2,3,3,3,2,6,null,18,0,null,35,0]
[6,4,4,4,2,1,1,2,2,5,null,20,0,null,31,0]
[4,6,5,4,4,5,6,5,1,2,null,23,0,null,42,0]
[4,4,2,4,1,6,6,5,2,4,null,15,0,null,38,0]
[3,3,1,1,6,2,2,6,3,6,null,14,0,null,33,0]
[4,4,2,5,6,3,4,2,1,6,null,21,0,null,37,0]
[1,6,1,4,5,1,5,3,3,2,null,17,0,null,31,0]
[6,2,5,5,3,4,3,4,5,3,null,21,0,null,40,0]
[6,4,4,2,6,3,3,4,6,4,null,22,0,null,42,0]
[5,6,3,3,2,6,4,3,1,5,null,19,0,null,38,0]
[6,6,4,1,6,2,2,4,4,6,null,23,0,null,41,0]
[4,6,2,1,3,6,2,1,2,3,null,16,0,null,30,0]
[3,2,5,1,3,{"$f":"INT(RAND()*6+1)","v":6},4,3,3,1,null,14,0,null,31,0]
[{"$f":"INT(RAND()*6+1)","v":6},4,6,3,2,4,2,2,4,4,null,21,0,null,37,0]
[6,5,3,2,3,4,4,1,4,6,null,19,0,null,38,0]
[1,2,2,6,3,2,1,4,5,3,null,14,0,null,29,0]
[2,4,3,1,6,4,3,2,3,5,null,16,0,null,33,0]
[3,3,3,6,2,6,2,4,2,2,null,17,0,null,33,0]
[6,1,6,1,4,3,2,2,6,6,null,18,0,null,37,0]
[6,5,6,6,1,6,2,5,5,2,null,24,0,null,44,0]
[4,3,2,6,2,3,2,5,4,4,null,17,0,null,35,0]
[3,2,5,5,1,1,3,6,2,4,null,16,0,null,32,0]
[6,5,6,5,5,1,3,2,1,1,null,27,1,null,35,0]
[3,4,5,4,5,5,2,2,3,2,null,21,0,null,35,0]
[3,5,4,6,2,4,2,3,2,2,null,20,0,null,33,0]
[6,1,6,1,2,6,2,4,2,2,null,16,0,null,32,0]
[5,4,1,3,4,3,3,1,6,2,null,17,0,null,32,0]
[4,3,3,2,2,2,1,2,2,6,null,14,0,null,27,0]
[6,6,1,1,2,3,1,6,1,4,null,16,0,null,31,0]
[6,6,3,1,6,3,5,2,6,1,null,22,0,null,39,0]
[1,5,3,3,3,6,1,6,3,5,null,15,0,null,36,0]
[3,1,6,4,6,2,1,2,5,3,null,20,0,null,33,0]
[2,5,1,6,3,6,1,5,2,5,null,17,0,null,36,0]
[5,6,1,3,2,2,1,1,6,4,null,17,0,null,31,0]
[4,6,3,1,1,6,5,1,5,5,null,15,0,null,37,0]
[2,4,4,4,1,5,6,2,3,5,null,15,0,null,36,0]
[2,2,1,1,2,5,3,2,1,3,null,8,0,null,22,0]
[3,4,5,1,5,5,4,3,4,3,null,18,0,null,37,0]
[1,4,5,3,3,4,1,3,6,4,null,16,0,null,34,0]
[4,3,5,4,5,5,3,2,3,5,null,21,0,null,39,0]
[6,5,5,5,4,3,4,6,5,1,null,25,1,null,44,0]
[4,1,3,2,4,1,5,1,5,3,null,14,0,null,29,0]
[6,5,4,2,1,4,2,4,4,3,null,18,0,null,35,0]
[6,2,3,5,2,6,2,2,2,2,null,18,0,null,32,0]
[1,5,1,3,3,3,5,2,4,5,null,13,0,null,32,0]
[4,1,5,2,6,6,4,5,5,4,null,18,0,null,42,0]
[2,4,4,6,6,3,3,5,6,5,null,22,0,null,44,0]
[5,6,4,6,4,2,4,5,5,5,null,25,1,null,46,1]
[6,3,4,3,1,6,6,3,2,5,null,17,0,null,39,0]
[5,5,4,4,3,1,1,5,6,3,null,21,0,null,37,0]
[2,2,1,2,3,5,3,3,3,1,null,10,0,null,25,0]
[3,1,2,4,4,1,4,3,1,6,null,14,0,null,29,0]
[6,6,1,5,6,4,2,6,1,1,null,24,0,null,38,0]
[6,3,4,5,5,4,4,3,5,3,null,23,0,null,42,0]
[4,5,3,1,6,1,5,5,4,5,null,19,0,null,39,0]
[5,6,2,3,2,6,6,5,3,1,null,18,0,null,39,0]
[3,6,3,4,4,2,5,4,5,6,null,20,0,null,42,0]
[5,5,6,3,3,4,1,5,1,4,null,22,0,null,37,0]
[1,3,1,1,4,5,3,4,2,6,null,{"$f":"SUM(A515:E515)","v":10},{"$f":"IF(L515>=25,1,0)","v":0},null,{"$f":"SUM(A515:J515)","v":30},{"$f":"IF(O515>=O$1,1,0)","v":0}]
[4,6,3,1,6,3,1,6,3,1,null,20,0,null,34,0]
[3,1,4,1,3,2,1,1,3,1,null,12,0,null,20,0]
[6,4,5,3,3,3,1,5,3,5,null,21,0,null,38,0]
[1,2,4,6,3,6,5,4,3,5,null,16,0,null,39,0]
[4,3,3,1,1,{"$f":"INT(RAND()*6+1)","v":6},6,5,1,6,null,12,0,null,36,0]
[{"$f":"INT(RAND()*6+1)","v":5},3,4,5,5,6,6,6,5,4,null,22,0,null,49,1]
[2,6,1,3,1,6,5,3,5,1,null,13,0,null,33,0]
[3,2,4,5,6,5,5,3,3,1,null,20,0,null,37,0]
[2,6,2,3,6,2,2,5,2,2,null,19,0,null,32,0]
[5,4,2,5,5,1,6,3,1,2,null,21,0,null,34,0]
[4,5,1,4,1,3,4,2,6,3,null,15,0,null,33,0]
[1,4,6,1,2,6,3,2,4,6,null,14,0,null,35,0]
[1,5,6,2,1,1,3,2,5,4,null,15,0,null,30,0]
[1,1,1,6,1,3,5,6,3,3,null,10,0,null,30,0]
[1,2,5,1,5,4,1,2,4,6,null,14,0,null,31,0]
[1,6,4,4,5,1,3,6,3,2,null,20,0,null,35,0]
[1,6,3,5,6,2,6,6,4,5,null,21,0,null,44,0]
[3,2,2,2,3,1,4,5,2,3,null,12,0,null,27,0]
[3,6,3,3,3,4,6,4,3,2,null,18,0,null,37,0]
[6,2,1,1,6,2,5,2,4,3,null,16,0,null,32,0]
[5,1,1,5,4,2,3,1,1,2,null,16,0,null,25,0]
[6,6,5,4,2,6,4,6,1,1,null,23,0,null,41,0]
[5,6,6,5,3,4,1,1,1,6,null,25,1,null,38,0]
[3,2,6,2,3,5,4,2,2,4,null,16,0,null,33,0]
[6,5,3,3,5,2,5,3,2,3,null,22,0,null,37,0]
[4,4,1,1,4,4,2,2,6,1,null,14,0,null,29,0]
[2,2,2,6,3,5,3,1,1,4,null,15,0,null,29,0]
[6,4,5,4,1,2,5,2,4,6,null,20,0,null,39,0]
[6,6,5,5,3,2,3,1,6,1,null,25,1,null,38,0]
[5,1,2,1,2,4,3,2,5,6,null,11,0,null,31,0]
[4,2,6,4,2,6,6,3,4,1,null,18,0,null,38,0]
[2,2,6,1,1,4,3,6,2,6,null,12,0,null,33,0]
[2,1,6,5,6,5,1,1,2,5,null,20,0,null,34,0]
[3,5,3,2,1,4,2,6,2,4,null,14,0,null,32,0]
[5,3,6,2,1,6,2,2,3,1,null,17,0,null,31,0]
[2,5,5,5,4,1,1,2,6,5,null,21,0,null,36,0]
[5,4,6,4,3,6,2,5,6,6,null,22,0,null,47,1]
[1,1,3,5,3,2,3,2,4,4,null,13,0,null,28,0]
[5,1,3,2,2,6,5,1,1,5,null,13,0,null,31,0]
[3,2,1,3,3,5,5,2,4,6,null,12,0,null,34,0]
[2,5,6,4,5,2,3,3,5,3,null,22,0,null,38,0]
[3,4,2,3,6,6,5,5,2,6,null,18,0,null,42,0]
[1,6,6,4,6,1,4,1,3,4,null,23,0,null,36,0]
[2,5,6,6,1,5,6,3,2,5,null,20,0,null,41,0]
[3,5,4,2,6,1,5,2,4,2,null,20,0,null,34,0]
[5,1,5,3,4,2,2,5,4,1,null,18,0,null,32,0]
[4,4,6,1,6,6,3,2,5,6,null,21,0,null,43,0]
[4,1,2,3,3,5,5,5,2,1,null,13,0,null,31,0]
[6,1,1,1,4,1,3,6,6,6,null,13,0,null,35,0]
[3,4,6,5,2,5,1,6,3,5,null,20,0,null,40,0]
[4,1,1,5,3,4,6,2,1,5,null,14,0,null,32,0]
[2,3,2,3,5,5,1,5,6,1,null,15,0,null,33,0]
[3,2,5,6,4,3,4,4,4,4,null,20,0,null,39,0]
[5,4,5,3,2,6,3,4,2,3,null,19,0,null,37,0]
[2,6,5,1,6,5,3,1,6,6,null,20,0,null,41,0]
[6,1,5,3,2,{"$f":"INT(RAND()*6+1)","v":4},1,3,5,2,null,17,0,null,32,0]
[{"$f":"INT(RAND()*6+1)","v":5},2,5,1,2,6,1,4,3,6,null,15,0,null,35,0]
[6,2,6,2,2,4,4,5,5,2,null,18,0,null,38,0]
[4,1,3,2,2,1,6,3,6,3,null,12,0,null,31,0]
[4,1,1,5,4,5,6,5,2,3,null,15,0,null,36,0]
[4,3,2,4,6,1,1,2,1,6,null,19,0,null,30,0]
[5,2,5,4,4,2,5,3,6,5,null,20,0,null,41,0]
[6,1,6,6,2,4,3,1,1,3,null,21,0,null,33,0]
[3,3,1,3,2,5,5,1,1,4,null,{"$f":"SUM(A579:E579)","v":12},{"$f":"IF(L579>=25,1,0)","v":0},null,{"$f":"SUM(A579:J579)","v":28},{"$f":"IF(O579>=O$1,1,0)","v":0}]
[4,3,5,2,4,5,3,2,1,1,null,18,0,null,30,0]
[1,6,2,4,3,4,2,4,3,1,null,16,0,null,30,0]
[6,2,5,1,3,3,4,4,1,5,null,17,0,null,34,0]
[3,4,1,1,3,2,3,4,4,2,null,12,0,null,27,0]
[6,5,1,4,6,3,1,2,1,5,null,22,0,null,34,0]
[2,2,3,2,6,1,1,2,6,6,null,15,0,null,31,0]
[5,1,6,4,2,2,5,2,1,5,null,18,0,null,33,0]
[5,4,5,5,2,6,6,5,6,1,null,21,0,null,45,0]
[5,2,1,2,3,5,4,3,2,3,null,13,0,null,30,0]
[5,3,4,5,1,4,3,3,1,1,null,18,0,null,30,0]
[6,2,1,2,3,3,4,3,4,2,null,14,0,null,30,0]
[3,1,1,2,4,6,4,4,2,4,null,11,0,null,31,0]
[5,5,1,3,4,4,5,4,6,5,null,18,0,null,42,0]
[4,3,3,1,1,2,2,5,1,6,null,12,0,null,28,0]
[4,2,1,5,2,3,4,2,6,6,null,14,0,null,35,0]
[2,2,3,2,3,1,4,1,5,1,null,12,0,null,24,0]
[2,6,2,2,1,4,2,4,1,6,null,13,0,null,30,0]
[2,2,2,4,6,4,3,5,1,6,null,16,0,null,35,0]
[1,1,1,2,6,5,1,1,5,1,null,11,0,null,24,0]
[1,3,2,6,2,6,3,5,5,4,null,14,0,null,37,0]
[2,5,2,4,4,5,3,3,3,3,null,17,0,null,34,0]
[4,2,3,2,6,2,1,1,1,2,null,17,0,null,24,0]
[3,2,4,5,4,6,2,1,1,6,null,18,0,null,34,0]
[5,1,1,5,6,6,1,6,2,5,null,18,0,null,38,0]
[6,5,5,2,5,2,4,5,5,3,null,23,0,null,42,0]
[6,2,6,4,2,3,2,4,1,4,null,20,0,null,34,0]
[3,5,3,1,3,3,6,6,6,3,null,15,0,null,39,0]
[6,5,2,6,4,6,2,6,6,5,null,23,0,null,48,1]
[2,5,1,6,1,3,6,2,5,4,null,15,0,null,35,0]
[1,4,1,6,1,6,2,6,4,3,null,13,0,null,34,0]
[3,1,5,6,2,6,4,1,5,5,null,17,0,null,38,0]
[5,1,4,6,3,2,6,4,3,3,null,19,0,null,37,0]
[1,1,5,4,3,6,5,1,5,6,null,14,0,null,37,0]
[5,4,5,1,5,5,6,6,2,5,null,20,0,null,44,0]
[3,3,2,6,1,4,6,3,5,6,null,15,0,null,39,0]
[1,1,5,4,1,3,2,4,5,5,null,12,0,null,31,0]
[3,5,6,3,3,3,1,6,3,1,null,20,0,null,34,0]
[2,1,4,3,2,6,1,6,3,6,null,12,0,null,34,0]
[5,2,4,3,1,1,1,4,5,1,null,15,0,null,27,0]
[6,5,5,1,6,4,3,1,2,1,null,23,0,null,34,0]
[1,1,4,5,4,3,4,4,4,6,null,15,0,null,36,0]
[4,3,1,4,6,1,4,5,4,1,null,18,0,null,33,0]
[2,2,4,1,1,{"$f":"INT(RAND()*6+1)","v":5},5,5,4,1,null,10,0,null,30,0]
[{"$f":"INT(RAND()*6+1)","v":4},4,5,2,4,2,3,4,6,6,null,19,0,null,40,0]
[2,5,6,4,4,1,1,1,6,2,null,21,0,null,32,0]
[4,1,3,3,4,1,3,3,2,5,null,15,0,null,29,0]
[1,4,5,6,5,3,2,6,3,1,null,21,0,null,36,0]
[3,2,2,2,3,4,2,3,6,6,null,12,0,null,33,0]
[2,3,3,3,3,1,5,3,2,6,null,14,0,null,31,0]
[5,6,6,1,6,5,3,1,1,3,null,24,0,null,37,0]
[1,6,6,4,1,4,3,6,5,6,null,18,0,null,42,0]
[1,2,1,5,3,4,5,5,5,5,null,12,0,null,36,0]
[6,4,5,3,2,2,5,1,2,3,null,20,0,null,33,0]
[4,2,5,1,5,5,6,6,2,6,null,17,0,null,42,0]
[6,6,3,5,2,5,3,4,5,6,null,22,0,null,45,0]
[4,1,4,2,2,2,6,4,5,6,null,13,0,null,36,0]
[3,1,6,3,5,4,1,3,1,5,null,18,0,null,32,0]
[4,6,6,3,5,1,2,1,3,4,null,24,0,null,35,0]
[5,5,2,5,6,4,4,5,6,5,null,23,0,null,47,1]
[2,2,1,3,6,4,2,6,2,6,null,14,0,null,34,0]
[2,6,6,5,2,1,5,2,2,3,null,21,0,null,34,0]
[3,2,6,3,4,3,3,3,5,4,null,18,0,null,36,0]
[4,4,6,5,6,2,6,1,2,5,null,25,1,null,41,0]
[1,5,2,6,2,6,3,5,3,4,null,{"$f":"SUM(A643:E643)","v":16},{"$f":"IF(L643>=25,1,0)","v":0},null,{"$f":"SUM(A643:J643)","v":37},{"$f":"IF(O643>=O$1,1,0)","v":0}]
[5,2,2,2,4,5,2,5,3,4,null,15,0,null,34,0]
[2,6,3,4,2,1,4,1,2,5,null,17,0,null,30,0]
[5,5,1,2,4,4,4,3,5,5,null,17,0,null,38,0]
[1,6,3,1,1,1,2,4,5,5,null,12,0,null,29,0]
[6,3,3,5,1,1,4,3,4,4,null,18,0,null,34,0]
[6,3,6,3,6,1,1,2,6,5,null,24,0,null,39,0]
[3,3,3,3,3,5,3,4,5,2,null,15,0,null,34,0]
[3,2,6,1,6,5,2,4,4,1,null,18,0,null,34,0]
[3,1,5,3,4,3,1,3,3,2,null,16,0,null,28,0]
[1,3,3,3,1,6,1,1,6,5,null,11,0,null,30,0]
[5,6,6,6,6,2,3,2,1,3,null,29,1,null,40,0]
[3,3,1,2,4,3,4,5,4,4,null,13,0,null,33,0]
[1,2,4,4,3,2,5,4,6,5,null,14,0,null,36,0]
[4,4,4,6,4,2,2,4,2,1,null,22,0,null,33,0]
[6,6,3,4,3,3,5,1,2,2,null,22,0,null,35,0]
[6,1,5,4,5,2,3,5,5,1,null,21,0,null,37,0]
[2,6,2,1,1,4,1,2,3,1,null,12,0,null,23,0]
[2,4,5,3,1,6,5,3,4,1,null,15,0,null,34,0]
[1,5,3,2,2,5,6,5,5,3,null,13,0,null,37,0]
[3,3,4,2,3,2,4,6,2,3,null,15,0,null,32,0]
[1,3,3,4,4,5,5,5,6,4,null,15,0,null,40,0]
[5,2,2,6,5,3,3,4,2,2,null,20,0,null,34,0]
[1,5,5,6,1,5,3,5,3,5,null,18,0,null,39,0]
[1,3,5,4,2,3,4,3,1,5,null,15,0,null,31,0]
[3,5,3,2,4,5,3,6,1,4,null,17,0,null,36,0]
[4,4,3,4,3,6,4,6,6,3,null,18,0,null,43,0]
[5,1,1,6,5,6,5,2,4,5,null,18,0,null,40,0]
[5,1,4,2,6,4,6,4,4,3,null,18,0,null,39,0]
[2,5,3,1,5,5,6,4,2,6,null,16,0,null,39,0]
[1,2,4,3,4,{"$f":"INT(RAND()*6+1)","v":4},1,5,6,5,null,14,0,null,35,0]
[{"$f":"INT(RAND()*6+1)","v":2},6,6,2,3,5,2,3,6,3,null,19,0,null,38,0]
[5,3,5,6,3,1,3,4,6,6,null,22,0,null,42,0]
[1,5,6,6,6,1,4,5,4,2,null,24,0,null,40,0]
[5,1,4,6,5,1,2,1,1,5,null,21,0,null,31,0]
[5,5,3,6,6,1,5,6,1,4,null,25,1,null,42,0]
[5,6,3,6,1,1,6,2,5,1,null,21,0,null,36,0]
[1,4,6,6,1,2,3,1,1,5,null,18,0,null,30,0]
[6,6,5,4,2,3,3,1,4,2,null,23,0,null,36,0]
[6,6,6,5,5,4,3,6,5,4,null,28,1,null,50,1]
[1,1,1,6,3,5,2,1,5,6,null,12,0,null,31,0]
[3,6,2,5,1,3,3,2,6,6,null,17,0,null,37,0]
[5,6,1,5,1,3,1,6,2,6,null,18,0,null,36,0]
[1,5,3,5,5,5,1,4,2,1,null,19,0,null,32,0]
[3,2,1,1,6,6,3,4,6,6,null,13,0,null,38,0]
[3,5,3,4,6,4,6,5,2,2,null,21,0,null,40,0]
[6,3,2,4,3,5,2,6,1,6,null,18,0,null,38,0]
[1,4,1,1,4,4,4,2,5,1,null,11,0,null,27,0]
[4,1,4,2,5,3,1,3,4,6,null,16,0,null,33,0]
[1,1,3,1,1,2,2,3,5,1,null,7,0,null,20,0]
[1,6,5,1,4,6,4,3,2,1,null,17,0,null,33,0]
[2,4,6,2,2,3,6,1,2,3,null,16,0,null,31,0]
[6,5,1,6,1,3,3,1,4,1,null,19,0,null,31,0]
[2,5,3,5,5,4,3,6,3,6,null,20,0,null,42,0]
[4,1,5,3,2,5,4,5,5,2,null,15,0,null,36,0]
[1,6,2,6,6,4,6,6,3,4,null,21,0,null,44,0]
[6,3,5,1,2,3,3,2,6,3,null,17,0,null,34,0]
[6,5,2,2,5,3,1,5,2,5,null,20,0,null,36,0]
[4,1,6,2,5,5,1,6,4,3,null,18,0,null,37,0]
[4,3,3,5,4,4,4,1,2,6,null,19,0,null,36,0]
[3,1,3,4,2,5,6,1,5,2,null,13,0,null,32,0]
[5,2,4,3,5,2,3,1,4,1,null,19,0,null,30,0]
[1,6,4,3,3,3,3,2,6,1,null,17,0,null,32,0]
[3,2,1,4,5,1,4,4,3,5,null,15,0,null,32,0]
[5,5,2,5,3,6,6,3,3,4,null,{"$f":"SUM(A707:E707)","v":20},{"$f":"IF(L707>=25,1,0)","v":0},null,{"$f":"SUM(A707:J707)","v":42},{"$f":"IF(O707>=O$1,1,0)","v":0}]
[5,3,6,4,5,2,1,1,4,2,null,23,0,null,33,0]
[3,4,2,3,1,4,5,5,3,6,null,13,0,null,36,0]
[3,3,3,6,1,1,1,1,3,4,null,16,0,null,26,0]
[1,1,1,6,4,1,1,3,3,2,null,13,0,null,23,0]
[2,5,5,1,4,3,3,6,6,2,null,17,0,null,37,0]
[5,2,2,2,1,3,6,3,5,5,null,12,0,null,34,0]
[6,6,5,6,6,5,2,2,6,3,null,29,1,null,47,1]
[2,5,6,5,5,2,3,5,2,4,null,23,0,null,39,0]
[1,3,1,1,1,6,6,6,5,6,null,7,0,null,36,0]
[5,4,6,1,1,3,2,3,6,6,null,17,0,null,37,0]
[1,6,3,4,6,6,4,2,2,1,null,20,0,null,35,0]
[6,3,5,4,1,4,1,5,5,5,null,19,0,null,39,0]
[5,4,6,3,3,4,5,5,6,2,null,21,0,null,43,0]
[4,5,5,1,5,2,3,6,3,6,null,20,0,null,40,0]
[2,5,3,1,3,5,2,6,6,2,null,14,0,null,35,0]
[4,3,4,2,4,1,1,4,2,2,null,17,0,null,27,0]
[1,4,2,1,1,{"$f":"INT(RAND()*6+1)","v":3},3,1,4,6,null,9,0,null,26,0]
[{"$f":"INT(RAND()*6+1)","v":2},1,2,6,2,6,4,4,1,2,null,13,0,null,30,0]
[6,4,3,6,5,5,1,2,2,4,null,24,0,null,38,0]
[1,1,4,5,5,2,4,4,6,6,null,16,0,null,38,0]
[5,4,1,3,6,6,2,5,3,5,null,19,0,null,40,0]
[2,5,1,2,2,4,2,4,5,2,null,12,0,null,29,0]
[5,3,6,1,2,3,5,1,3,2,null,17,0,null,31,0]
[6,2,2,1,1,1,5,4,2,4,null,12,0,null,28,0]
[5,1,1,3,5,6,5,1,5,3,null,15,0,null,35,0]
[4,3,1,3,3,3,1,1,1,4,null,14,0,null,24,0]
[6,6,6,4,3,4,6,4,1,2,null,25,1,null,42,0]
[6,5,5,6,2,3,1,5,1,4,null,24,0,null,38,0]
[4,2,4,6,1,2,5,2,4,5,null,17,0,null,35,0]
[4,3,1,2,3,2,3,2,5,5,null,13,0,null,30,0]
[4,3,2,2,5,4,4,3,3,5,null,16,0,null,35,0]
[5,1,3,1,5,1,3,5,4,1,null,15,0,null,29,0]
[1,1,4,3,4,5,3,4,4,6,null,13,0,null,35,0]
[1,2,5,5,4,3,5,3,5,6,null,17,0,null,39,0]
[2,5,5,1,6,2,4,4,4,4,null,19,0,null,37,0]
[4,4,6,3,1,4,6,5,4,1,null,18,0,null,38,0]
[2,5,5,6,6,2,4,5,1,2,null,24,0,null,38,0]
[6,6,2,1,3,4,4,6,3,4,null,18,0,null,39,0]
[1,2,1,6,1,3,2,5,2,4,null,11,0,null,27,0]
[1,1,2,6,1,6,5,2,1,4,null,11,0,null,29,0]
[1,4,5,5,1,4,3,3,5,1,null,16,0,null,32,0]
[1,5,2,1,3,2,5,3,6,3,null,12,0,null,31,0]
[5,3,2,4,2,3,1,3,2,1,null,16,0,null,26,0]
[4,4,3,1,4,6,5,6,6,3,null,16,0,null,42,0]
[6,1,1,1,2,6,2,3,4,4,null,11,0,null,30,0]
[2,1,2,1,5,1,5,1,3,3,null,11,0,null,24,0]
[2,2,4,5,3,6,3,3,4,1,null,16,0,null,33,0]
[1,4,3,2,4,5,5,1,5,1,null,14,0,null,31,0]
[5,5,2,2,2,3,6,3,3,3,null,16,0,null,34,0]
[6,2,4,3,1,3,1,2,2,3,null,16,0,null,27,0]
[3,1,4,1,1,6,5,5,3,5,null,10,0,null,34,0]
[5,4,2,3,4,4,1,6,3,1,null,18,0,null,33,0]
[4,4,4,5,4,4,3,1,1,1,null,21,0,null,31,0]
[4,6,6,4,1,5,5,6,5,6,null,21,0,null,48,1]
[4,5,2,4,2,1,2,3,5,4,null,17,0,null,32,0]
[6,4,4,6,6,2,1,3,5,2,null,26,1,null,39,0]
[1,6,2,6,3,4,3,3,4,6,null,18,0,null,38,0]
[5,5,5,1,4,4,3,4,5,4,null,20,0,null,40,0]
[2,6,6,2,4,6,5,6,3,6,null,20,0,null,46,1]
[3,2,6,1,3,6,3,4,2,3,null,15,0,null,33,0]
[1,4,1,4,4,2,6,4,2,2,null,14,0,null,30,0]
[2,4,3,1,6,6,2,5,1,5,null,16,0,null,35,0]
[2,3,4,1,2,4,6,1,1,5,null,12,0,null,29,0]
[2,6,2,5,1,4,5,2,1,3,null,{"$f":"SUM(A771:E771)","v":16},{"$f":"IF(L771>=25,1,0)","v":0},null,{"$f":"SUM(A771:J771)","v":31},{"$f":"IF(O771>=O$1,1,0)","v":0}]
[3,4,6,2,1,2,1,1,6,3,null,16,0,null,29,0]
[4,1,6,2,3,5,4,3,4,5,null,16,0,null,37,0]
[2,4,3,3,2,1,4,6,1,1,null,14,0,null,27,0]
[1,4,5,6,2,{"$f":"INT(RAND()*6+1)","v":6},5,4,2,1,null,18,0,null,36,0]
[{"$f":"INT(RAND()*6+1)","v":6},5,3,5,2,6,5,3,2,4,null,21,0,null,41,0]
[5,1,1,6,5,5,5,2,3,4,null,18,0,null,37,0]
[2,6,3,4,3,5,4,5,3,4,null,18,0,null,39,0]
[5,5,4,3,3,6,6,6,2,2,null,20,0,null,42,0]
[4,3,3,3,6,6,2,3,4,4,null,19,0,null,38,0]
[3,3,5,3,4,5,1,4,4,1,null,18,0,null,33,0]
[1,1,2,3,6,2,4,4,6,6,null,13,0,null,35,0]
[2,5,5,2,6,1,3,5,5,6,null,20,0,null,40,0]
[5,1,2,4,5,6,4,2,2,2,null,17,0,null,33,0]
[6,4,3,3,1,4,5,1,3,3,null,17,0,null,33,0]
[4,5,4,6,3,3,1,3,4,5,null,22,0,null,38,0]
[4,2,2,1,6,4,4,4,2,6,null,15,0,null,35,0]
[6,6,4,5,1,6,2,1,5,2,null,22,0,null,38,0]
[4,6,4,5,2,3,1,6,3,6,null,21,0,null,40,0]
[6,3,1,6,6,1,2,4,1,5,null,22,0,null,35,0]
[6,3,4,3,6,3,2,3,6,5,null,22,0,null,41,0]
[5,4,6,2,4,1,4,6,3,5,null,21,0,null,40,0]
[3,3,6,5,3,2,6,4,2,4,null,20,0,null,38,0]
[6,1,1,5,3,2,4,3,1,5,null,16,0,null,31,0]
[1,2,4,3,2,6,3,3,5,2,null,12,0,null,31,0]
[3,5,2,2,6,6,3,3,4,5,null,18,0,null,39,0]
[3,5,3,3,5,6,1,2,3,2,null,19,0,null,33,0]
[1,4,3,2,3,6,3,6,6,5,null,13,0,null,39,0]
[4,5,6,4,3,3,2,1,6,5,null,22,0,null,39,0]
[6,5,6,2,4,5,5,6,4,3,null,23,0,null,46,1]
[4,6,3,2,6,2,1,3,5,1,null,21,0,null,33,0]
[4,3,5,4,3,6,4,4,4,5,null,19,0,null,42,0]
[4,3,4,1,3,5,1,6,3,2,null,15,0,null,32,0]
[1,6,1,1,1,4,4,6,1,1,null,10,0,null,26,0]
[3,3,6,1,5,1,2,4,5,5,null,18,0,null,35,0]
[2,4,5,2,5,4,1,6,5,2,null,18,0,null,36,0]
[5,3,6,5,1,6,2,1,4,6,null,20,0,null,39,0]
[4,1,2,3,2,1,6,5,4,2,null,12,0,null,30,0]
[5,6,5,3,1,2,2,5,4,2,null,20,0,null,35,0]
[5,3,4,3,4,3,5,3,2,6,null,19,0,null,38,0]
[2,1,5,2,6,5,3,2,5,4,null,16,0,null,35,0]
[5,4,5,5,3,3,2,5,1,4,null,22,0,null,37,0]
[5,1,4,2,1,3,3,5,3,3,null,13,0,null,30,0]
[4,4,6,1,1,5,5,1,3,6,null,16,0,null,36,0]
[4,6,3,4,1,5,5,2,5,1,null,18,0,null,36,0]
[6,5,2,3,2,3,3,4,6,3,null,18,0,null,37,0]
[6,6,5,3,3,6,2,3,5,5,null,23,0,null,44,0]
[4,3,4,4,5,5,4,6,4,3,null,20,0,null,42,0]
[5,5,3,5,1,4,5,6,3,6,null,19,0,null,43,0]
[1,2,4,6,5,1,5,3,2,6,null,18,0,null,35,0]
[6,3,1,3,5,2,4,1,4,5,null,18,0,null,34,0]
[4,5,4,5,1,5,1,6,4,3,null,19,0,null,38,0]
[1,2,1,6,1,1,4,6,1,3,null,11,0,null,26,0]
[5,3,2,3,4,1,2,6,4,4,null,17,0,null,34,0]
[1,4,3,2,4,6,6,5,3,6,null,14,0,null,40,0]
[1,6,2,4,6,{"$f":"INT(RAND()*6+1)","v":3},3,5,1,4,null,19,0,null,35,0]
[{"$f":"INT(RAND()*6+1)","v":6},6,4,3,4,3,2,1,2,2,null,23,0,null,33,0]
[1,1,3,5,1,6,4,6,3,1,null,11,0,null,31,0]
[1,6,1,1,1,6,6,6,6,3,null,10,0,null,37,0]
[5,5,6,3,3,6,5,4,6,1,null,22,0,null,44,0]
[6,5,6,5,2,4,4,3,3,2,null,24,0,null,40,0]
[4,3,4,1,1,6,1,5,2,5,null,13,0,null,32,0]
[4,4,3,6,3,5,4,2,3,1,null,20,0,null,35,0]
[5,6,3,3,5,6,1,6,2,6,null,22,0,null,43,0]
[6,6,3,4,2,2,6,1,4,3,null,{"$f":"SUM(A835:E835)","v":21},{"$f":"IF(L835>=25,1,0)","v":0},null,{"$f":"SUM(A835:J835)","v":37},{"$f":"IF(O835>=O$1,1,0)","v":0}]
[3,1,2,2,6,6,1,5,1,5,null,14,0,null,32,0]
[6,6,6,6,4,5,5,1,3,1,null,28,1,null,43,0]
[5,1,3,6,1,3,1,4,3,5,null,16,0,null,32,0]
[1,3,4,2,4,2,2,6,6,4,null,14,0,null,34,0]
[4,1,2,1,6,1,1,1,6,3,null,14,0,null,26,0]
[3,3,4,3,5,5,5,2,1,6,null,18,0,null,37,0]
[3,2,1,4,4,1,4,1,3,4,null,14,0,null,27,0]
[4,3,1,1,2,1,1,1,1,1,null,11,0,null,16,0]
[6,3,2,6,6,2,3,2,2,3,null,23,0,null,35,0]
[2,3,4,6,1,2,4,3,2,4,null,16,0,null,31,0]
[1,3,6,3,5,6,1,6,1,4,null,18,0,null,36,0]
[5,6,5,6,3,5,1,1,5,2,null,25,1,null,39,0]
[3,5,1,5,2,2,4,5,4,1,null,16,0,null,32,0]
[1,2,5,1,1,4,1,5,1,4,null,10,0,null,25,0]
[3,1,6,1,4,4,5,5,1,4,null,15,0,null,34,0]
[2,3,3,5,4,1,5,3,6,5,null,17,0,null,37,0]
[6,1,1,5,4,2,2,2,4,3,null,17,0,null,30,0]
[4,1,2,3,6,2,6,2,6,1,null,16,0,null,33,0]
[1,1,4,1,5,3,5,5,4,2,null,12,0,null,31,0]
[6,2,2,2,2,1,6,3,4,3,null,14,0,null,31,0]
[6,3,6,1,3,3,5,5,2,2,null,19,0,null,36,0]
[6,4,1,2,2,3,5,3,6,2,null,15,0,null,34,0]
[4,4,5,4,4,5,1,2,6,6,null,21,0,null,41,0]
[{"$f":"INT(RAND()*6+1)","v":5},4,4,5,2,2,6,3,2,1,null,20,0,null,34,0]
[1,3,4,5,6,2,3,6,1,1,null,19,0,null,32,0]
[5,4,3,3,5,4,1,4,6,4,null,20,0,null,39,0]
[1,6,4,5,1,5,3,6,2,3,null,17,0,null,36,0]
[6,6,4,1,3,3,1,4,6,6,null,20,0,null,40,0]
[6,4,5,4,3,3,2,3,4,4,null,22,0,null,38,0]
[3,6,4,6,5,4,1,6,4,1,null,24,0,null,40,0]
[3,1,4,3,3,3,6,6,5,5,null,14,0,null,39,0]
[2,5,1,6,1,4,5,3,3,6,null,15,0,null,36,0]
[2,4,2,5,6,3,3,4,1,1,null,19,0,null,31,0]
[1,1,1,3,3,6,2,3,2,1,null,9,0,null,23,0]
[6,1,4,5,6,5,3,6,4,3,null,22,0,null,43,0]
[3,6,5,5,2,1,4,1,6,5,null,21,0,null,38,0]
[6,2,5,5,6,5,2,1,6,3,null,24,0,null,41,0]
[6,1,2,5,3,5,3,5,3,1,null,17,0,null,34,0]
[1,4,6,1,3,4,5,6,4,6,null,15,0,null,40,0]
[6,3,5,1,5,3,3,5,1,6,null,20,0,null,38,0]
[4,4,5,5,5,5,4,5,3,4,null,23,0,null,44,0]
[3,3,3,3,3,3,4,4,5,2,null,15,0,null,33,0]
[2,2,6,3,2,1,6,1,3,1,null,15,0,null,27,0]
[2,4,6,4,2,3,5,2,3,6,null,18,0,null,37,0]
[6,3,5,5,1,2,3,2,1,6,null,20,0,null,34,0]
[6,1,1,3,3,2,2,4,6,1,null,14,0,null,29,0]
[3,5,4,4,1,1,4,3,6,1,null,17,0,null,32,0]
[6,6,3,6,2,4,1,2,4,6,null,23,0,null,40,0]
[6,5,4,5,3,2,4,3,5,5,null,23,0,null,42,0]
[4,6,4,4,6,6,4,5,6,2,null,24,0,null,47,1]
[2,5,3,6,4,2,2,1,5,1,null,20,0,null,31,0]
[6,1,6,4,4,1,3,6,1,5,null,21,0,null,37,0]
[1,4,6,1,5,2,3,2,5,6,null,17,0,null,35,0]
[3,4,5,1,3,3,4,5,3,1,null,16,0,null,32,0]
[2,3,4,6,2,2,2,6,1,3,null,17,0,null,31,0]
[{"$f":"INT(RAND()*6+1)","v":5},6,5,4,1,2,5,6,6,6,null,21,0,null,46,1]
[1,6,4,5,2,5,1,5,1,4,null,18,0,null,34,0]
[2,3,1,1,2,1,6,1,6,5,null,9,0,null,28,0]
[4,1,3,2,4,4,5,4,6,1,null,14,0,null,34,0]
[3,6,4,4,1,5,5,2,6,1,null,18,0,null,37,0]
[6,1,6,3,4,6,5,6,1,3,null,20,0,null,41,0]
[4,5,4,6,2,5,5,2,1,2,null,21,0,null,36,0]
[2,5,5,5,5,5,1,2,5,3,null,22,0,null,38,0]
[4,4,5,4,5,4,4,1,4,6,null,{"$f":"SUM(A899:E899)","v":22},{"$f":"IF(L899>=25,1,0)","v":0},null,{"$f":"SUM(A899:J899)","v":41},{"$f":"IF(O899>=O$1,1,0)","v":0}]
[2,6,2,1,5,2,3,4,6,2,null,16,0,null,33,0]
[2,1,5,4,3,4,5,1,4,5,null,15,0,null,34,0]
[3,1,2,3,5,3,5,6,4,1,null,14,0,null,33,0]
[1,2,1,6,1,4,2,2,1,4,null,11,0,null,24,0]
[4,6,1,1,6,3,5,5,5,6,null,18,0,null,42,0]
[2,4,4,6,2,3,3,5,4,2,null,18,0,null,35,0]
[6,3,1,3,6,5,4,6,4,5,null,19,0,null,43,0]
[1,6,6,1,3,1,5,4,1,1,null,17,0,null,29,0]
[5,2,4,5,5,1,4,4,4,6,null,21,0,null,40,0]
[4,3,5,5,5,2,3,1,2,1,null,22,0,null,31,0]
[4,5,4,2,3,2,5,1,3,1,null,18,0,null,30,0]
[5,5,5,1,4,3,2,1,2,2,null,20,0,null,30,0]
[4,4,6,3,3,2,5,1,6,2,null,20,0,null,36,0]
[3,1,1,1,4,6,4,5,5,4,null,10,0,null,34,0]
[1,6,3,3,5,5,5,1,1,2,null,18,0,null,32,0]
[4,6,1,2,2,6,4,1,6,5,null,15,0,null,37,0]
[6,6,3,6,3,{"$f":"INT(RAND()*6+1)","v":6},1,2,3,2,null,24,0,null,38,0]
[{"$f":"INT(RAND()*6+1)","v":1},2,2,5,4,2,6,2,5,4,null,14,0,null,33,0]
[6,3,3,5,4,5,3,2,1,4,null,21,0,null,36,0]
[6,6,2,2,3,6,5,1,1,1,null,19,0,null,33,0]
[5,3,1,2,1,6,4,3,3,4,null,12,0,null,32,0]
[1,2,1,1,5,6,3,3,3,6,null,10,0,null,31,0]
[5,2,1,6,1,2,6,3,4,3,null,15,0,null,33,0]
[6,6,3,1,2,2,5,1,4,1,null,18,0,null,31,0]
[1,4,6,3,5,5,2,3,3,1,null,19,0,null,33,0]
[3,4,5,5,5,4,1,5,3,5,null,22,0,null,40,0]
[5,3,3,6,1,3,4,5,3,1,null,18,0,null,34,0]
[4,6,6,3,3,5,1,4,5,5,null,22,0,null,42,0]
[1,5,6,5,3,6,5,2,3,4,null,20,0,null,40,0]
[2,2,2,2,1,1,1,6,2,3,null,9,0,null,22,0]
[1,4,1,6,6,6,6,2,4,6,null,18,0,null,42,0]
[5,5,1,5,1,2,2,2,6,2,null,17,0,null,31,0]
[6,2,2,5,3,6,4,5,6,4,null,18,0,null,43,0]
[6,5,2,4,6,6,4,6,5,1,null,23,0,null,45,0]
[5,5,2,6,5,1,6,3,1,3,null,23,0,null,37,0]
[2,5,2,2,2,6,3,5,3,5,null,13,0,null,35,0]
[2,5,2,5,2,2,2,2,5,4,null,16,0,null,31,0]
[3,3,1,4,1,6,5,6,4,4,null,12,0,null,37,0]
[1,6,3,3,2,4,4,4,4,5,null,15,0,null,36,0]
[1,3,6,2,6,3,5,6,6,1,null,18,0,null,39,0]
[3,3,2,1,1,1,3,3,3,6,null,10,0,null,26,0]
[6,2,3,3,4,3,3,6,2,2,null,18,0,null,34,0]
[6,3,5,5,2,5,4,1,1,5,null,21,0,null,37,0]
[1,5,2,6,1,6,4,5,1,1,null,15,0,null,32,0]
[3,2,3,6,6,3,5,2,6,1,null,20,0,null,37,0]
[6,6,6,6,3,3,1,5,2,5,null,27,1,null,43,0]
[3,2,6,5,1,3,4,5,5,5,null,17,0,null,39,0]
[1,5,6,3,3,1,6,1,4,3,null,18,0,null,33,0]
[6,3,2,4,1,4,1,2,6,4,null,16,0,null,33,0]
[{"$f":"INT(RAND()*6+1)","v":3},4,5,6,3,1,3,1,3,4,null,21,0,null,33,0]
[3,5,5,5,3,5,4,4,6,6,null,21,0,null,46,1]
[6,1,5,1,1,5,5,5,2,2,null,14,0,null,33,0]
[4,1,1,6,2,6,5,2,1,5,null,14,0,null,33,0]
[2,3,5,4,4,5,6,3,6,1,null,18,0,null,39,0]
[4,3,3,4,1,6,2,4,5,3,null,15,0,null,35,0]
[2,3,6,4,3,6,5,4,5,2,null,18,0,null,40,0]
[6,5,2,5,6,1,2,6,2,1,null,24,0,null,36,0]
[5,5,3,3,1,4,3,4,4,4,null,17,0,null,36,0]
[3,1,3,6,4,3,5,5,5,4,null,17,0,null,39,0]
[2,4,5,4,3,1,1,1,6,6,null,18,0,null,33,0]
[2,4,4,5,5,4,6,6,6,3,null,20,0,null,45,0]
[2,4,2,2,6,5,2,1,2,3,null,16,0,null,29,0]
[4,3,3,5,3,1,1,2,5,2,null,18,0,null,29,0]
[5,4,5,3,4,4,1,5,1,1,null,{"$f":"SUM(A963:E963)","v":21},{"$f":"IF(L963>=25,1,0)","v":0},null,{"$f":"SUM(A963:J963)","v":33},{"$f":"IF(O963>=O$1,1,0)","v":0}]
[3,2,3,2,2,6,6,4,5,2,null,12,0,null,35,0]
[4,5,6,4,4,3,2,6,5,6,null,23,0,null,45,0]
[6,6,4,3,3,4,4,3,3,4,null,22,0,null,40,0]
[4,2,2,5,4,2,3,3,6,5,null,17,0,null,36,0]
[1,2,2,6,2,1,3,6,1,6,null,13,0,null,30,0]
[1,3,6,1,5,5,2,2,1,6,null,16,0,null,32,0]
[1,4,1,5,1,1,4,3,3,2,null,12,0,null,25,0]
[4,6,6,5,5,3,3,6,4,6,null,26,1,null,48,1]
[5,6,5,4,4,5,1,6,5,2,null,24,0,null,43,0]
[2,1,4,4,1,4,4,4,4,4,null,12,0,null,32,0]
[3,2,3,1,4,2,4,5,4,1,null,13,0,null,29,0]
[4,3,1,2,1,2,5,6,1,5,null,11,0,null,30,0]
[3,2,3,3,1,4,4,1,2,3,null,12,0,null,26,0]
[3,4,1,3,2,5,6,5,6,2,null,13,0,null,37,0]
[1,1,2,2,4,6,4,6,1,3,null,10,0,null,30,0]
[1,3,6,3,4,4,1,3,1,6,null,17,0,null,32,0]
[2,4,1,6,3,2,1,4,3,4,null,16,0,null,30,0]
[{"$f":"INT(RAND()*6+1)","v":2},4,6,5,1,5,2,4,3,4,null,18,0,null,36,0]
[2,4,2,2,1,6,5,6,4,5,null,11,0,null,37,0]
[4,1,3,3,1,6,1,5,2,6,null,12,0,null,32,0]
[3,5,3,1,1,6,3,6,6,1,null,13,0,null,35,0]
[1,3,1,2,3,6,4,6,2,6,null,10,0,null,34,0]
[5,4,1,5,4,6,6,4,5,6,null,19,0,null,46,1]
[3,5,5,4,3,2,5,6,2,2,null,20,0,null,37,0]
[2,3,2,6,6,6,6,4,1,6,null,19,0,null,42,0]
[3,3,5,1,5,3,4,2,1,1,null,17,0,null,28,0]
[1,1,3,2,5,3,5,4,1,1,null,12,0,null,26,0]
[5,3,4,6,4,2,1,1,5,6,null,22,0,null,37,0]
[4,2,3,2,3,1,6,6,3,5,null,14,0,null,35,0]
[3,4,4,1,1,3,5,2,4,3,null,13,0,null,30,0]
[5,6,5,6,2,6,1,6,3,5,null,24,0,null,45,0]
[2,5,2,1,6,6,4,1,2,2,null,16,0,null,31,0]
[6,2,3,1,6,5,2,1,3,3,null,18,0,null,32,0]
[5,5,3,3,4,2,5,3,3,3,null,20,0,null,36,0]
[6,5,2,5,1,1,6,2,6,5,null,19,0,null,39,0]
[5,3,2,3,4,6,5,3,1,1,null,17,0,null,33,0]
[6,6,1,6,5,5,2,5,4,2,null,24,0,null,42,0]
[4,4,6,3,5,2,3,2,6,2,null,22,0,null,37,0]

{"sheet":"pi.greco","index":4,"n_rows":1000,"n_cols":11,"rows_kept":1000,"cut":false,"hidden":false,"merged":[]}
[{"$f":"RAND()","v":0.96242011088762536},{"$f":"RAND()","v":0.93523255879829625},{"$f":"(A1-0.5)^2+(B1-0.5)^2","v":0.4032597391914361},{"$f":"1*(C1<0.5^2)","v":0},{"$f":"1*(ABS(A1-B1)<0.25)","v":1},null,{"$f":"SUM(D:D)/1000*4","v":3.1760000000000002},null,null,479,3.1413862212943613]
[{"$f":"RAND()","v":0.67615763985420807},0.38500291190236113,{"$f":"(A2-0.5)^2+(B2-0.5)^2","v":4.4255844349940988E-2},{"$f":"1*(C2<0.5^2)","v":1},{"$f":"1*(ABS(A2-B2)<0.25)","v":0},null,null,null,null,{"$f":"J1+1","v":480},{"$f":"(K1*J1+G1)/(J1+1)","v":3.1414583333333312}]
[0.86022483633970526,0.71568276093211314,0.17628098607926651,1,1]
[6.7957706683747565E-2,3.9816790418939929E-2,0.39842912959429255,0,1]
[0.7808384856122681,0.12610080819641512,0.21867086063236607,1,0]
[0.90910640295034051,0.3437185914955837,0.19179192757909061,1,0]
[0.50451780316697048,0.59912596609045121,9.846367698820772E-3,1,1]
[0.56417676932857841,0.85347526148568464,0.12906341820382669,1,0]
[0.60597063848597299,0.46554064612647739,1.2417223290505439E-2,1,1]
[0.12351088666733212,0.92364720755494623,0.32122100892712213,0,0]
[0.65176269554491184,0.13865220699622904,0.15360414326775371,1,0]
[3.9393356253813794E-2,0.21134721431226455,0.29547891094841583,0,1]
[0.98523519568223827,6.5460667561696773E-2,0.42427762656470625,0,0]
[0.66124583585580443,0.82540776510465297,0.13189043317124202,1,1]
[0.58561914444043495,0.31292504106075447,4.2327678156832464E-2,1,0]
[0.61067018824948049,5.6912317800309697E-2,0.2085745846842692,1,0]
[0.25982714686847774,4.2561269467274565E-2,0.26693319157272716,0,1]
[0.44272714552368619,0.99889294982528476,0.25217435524523912,0,0]
[0.74087655417316434,4.3843224647108658E-2,0.26610051805068557,0,0]
[0.17767701821663684,0.53824213398195375,0.10535456539721197,1,0]
[0.55552274035151084,0.85942650701261869,0.13227018863943332,1,0]
[0.16838081677344596,4.4603762051528939E-2,0.31735701622146728,0,1]
[0.51543098338516258,0.1972657642754525,9.188613272795905E-2,1,0]
[0.82787956214806657,0.3746568856414999,0.12321590359149587,1,0]
[6.8901103061562941E-2,0.8257851304801489,0.29198221018350479,0,0]
[0.96806346506464913,0.7588433376157504,0.28608328075638734,0,1]
[6.3867189539759117E-3,0.12598607990906585,0.38354048364680882,0,1]
[0.97828861926287869,0.38101211336290319,0.24291812048275352,1,0]
[0.88513927435380535,0.25684831310870193,0.20745500348785961,1,0]
[0.45297050635846148,0.11439990829534152,0.15089920399482054,1,0]
[0.32920821097499986,0.66509010413244507,5.6424577680821715E-2,1,0]
[0.12055933233755567,0.71486694843330179,0.19014302580516068,1,0]
[0.53291320229967842,0.74931271748329209,6.3240109984523382E-2,1,1]
[0.66827421394866182,6.9799822096587638E-2,0.21338840414816765,1,0]
[9.8007372187984609E-2,0.10057976068231933,0.32113460039180286,0,1]
[0.95080494068102384,0.85841247037312041,0.33168459346138435,0,1]
[0.43572679874615805,0.67812847224584294,3.5860797024054904E-2,1,1]
[0.41181894727599844,1.2947252718447877E-2,0.24499627669402063,1,0]
[0.50332632335823702,0.59011723147152462,8.1321798351758987E-3,1,1]
[0.94039750734769778,0.64110597034630079,0.21386085934543664,1,0]
[0.69836124527028387,0.37752668610276585,5.4346896242148161E-2,1,0]
[0.35497682913502693,0.1693625182848445,0.13035286440267096,1,1]
[0.64350470223702794,0.7935104813838213,0.10674200224630055,1,1]
[0.40813963856766133,0.59203362023800776,1.6908513256593725E-2,1,1]
[0.56004727602723048,0.53158762215749278,4.6034532318549367E-3,1,1]
[0.88874335635156976,0.34484602456458469,0.17519415320089698,1,0]
[0.58654898883604067,0.20023796265551053,9.7348006501460194E-2,1,0]
[0.31612332813702204,0.4309745163509795,3.8575147848386469E-2,1,1]
[0.58508847015893473,0.25360201936354365,6.7952012615711446E-2,1,0]
[0.80072290825601689,0.81543610406620803,0.18993420329842436,1,1]
[0.18203830492124973,0.34882311625680162,0.12395408971565669,1,1]
[0.63176959562397428,0.11650038700677146,0.16443517949686176,1,0]
[0.29302208007025976,0.63802669935033496,6.1891229071989719E-2,1,0]
[0.42453925517253577,0.66600653241019026,3.325249281277122E-2,1,1]
[0.52638734613355642,0.40170468289573136,1.0358261400600843E-2,1,1]
[0.90582578247230461,0.18038189981029407,0.26685029568813523,0,0]
[0.99118510845446373,0.75157332731820559,0.30455194978537631,0,1]
[0.42597765315118963,0.56710151212349746,9.9819207622654643E-3,1,1]
[8.0463011017115615E-3,9.6833317896352633E-2,0.40456181541817127,0,1]
[0.62692377771883256,4.6015835065380206E-2,0.22221126736180369,1,0]
[0.5517545458750106,0.90275289160241146,0.16488842471283238,1,0]
[5.0382948930813964E-2,0.24039308603955367,0.26955124238821759,0,1]
[0.59432660182753239,6.9948423595415088E-3,0.25195159327242317,0,0]
[0.36329728686928131,0.78620827594807674,0.10060280899847002,1,0]
[2.6533557379461059E-2,0.28778692451729559,0.2692048616935761,0,0]
[{"$f":"RAND()","v":0.91621984751761221},0.3281141021055991,{"$f":"(A66-0.5)^2+(B66-0.5)^2","v":0.20278372336254877},{"$f":"1*(C66<0.5^2)","v":1},{"$f":"1*(ABS(A66-B66)<0.25)","v":0}]
[0.87812601284161018,0.22422680983067167,0.21903013400366206,1,0]
[0.80560772625217014,0.76294381825523394,0.16253553390366288,1,1]
[0.2259088297656755,0.8560629568553606,0.20190679884500384,1,0]
[0.67571594330013174,5.4453971519314193E-2,0.22938735622476719,1,0]
[0.15168819452767934,0.97966285624777749,0.35139756949516376,0,0]
[0.73950948214266921,0.700122262375516,9.7413711934544442E-2,1,1]
[0.89772640051129449,0.2888986539153936,0.20275006798240339,1,0]
[0.17512440488567638,0.72478210485818584,0.1560711469653624,1,0]
[0.8518438352631621,0.52627911621977652,0.12448467636198367,1,0]
[0.93531758200003845,0.42135256939493104,0.19568681553913933,1,0]
[1.0994857463165864E-2,0.74723872017617166,0.30025301418182077,0,0]
[6.2706159939713069E-2,5.2136786188360151E-2,0.39180736084036244,0,1]
[0.451794865634082,0.52672014836248049,3.0377013077491776E-3,1,1]
[0.58516631589817247,0.82885204240421539,0.11539696715709119,1,1]
[6.8146873835138289E-2,0.57969649848545424,0.19284865444920596,1,0]
[0.50075336189847086,0.56152426073654382,3.7858022133282956E-3,1,1]
[0.61056589836074571,0.40942804238041874,2.0428097387361975E-2,1,1]
[0.56900859347011945,0.60401504644306803,1.558131585927781E-2,1,1]
[2.6967610920825003E-2,0.61514540362446657,0.23701810509379331,1,0]
[0.9110556087536813,0.12371643943962929,0.3105560314358497,0,0]
[0.66485791719832221,0.92230985898404394,0.20552374985809194,1,0]
[0.19183360612343725,0.58558972094089579,0.10229212664562522,1,0]
[0.869291265127209,0.79965521870065559,0.22616928859379229,1,1]
[0.77092101589649675,0.66685496136890587,0.10123877498780892,1,1]
[0.99144907440615149,0.62510070198193668,0.25717237837103635,0,0]
[0.68642581714859285,0.35586589012198455,5.5529226929848408E-2,1,0]
[0.30455756149889079,0.29218278085172966,8.1385743341780073E-2,1,1]
[0.35553164183055297,0.42588854456506198,2.6363614338860437E-2,1,1]
[9.0633093929123665E-2,6.2920980315466335E-2,0.35861933323443462,0,1]
[3.355836922408284E-2,0.44708305352890942,0.2203679981447213,1,0]
[0.51214333851953686,0.179453393787111,0.10289758742500099,1,0]
[0.51915465982948039,0.46316496652672812,1.7237206841601699E-3,1,1]
[0.15449353054391635,0.38614775821957137,0.13233705339443685,1,1]
[0.16376595215135392,0.65959385590314934,0.13852353377472082,1,0]
[0.38427427099868505,0.21240640525784216,9.6102520089602309E-2,1,1]
[0.329498506047885,0.99081673816942406,0.26997182990717605,0,0]
[0.81822207066504937,0.6240092973499094,0.11664359208756993,1,1]
[0.71208047736856084,0.74574952533905492,0.10537095808524743,1,1]
[0.849830324338952,0.34823672653441995,0.14541334700008479,1,0]
[0.77598627018845667,0.49878326916125704,7.6169901766469747E-2,1,0]
[9.9301107191023363E-2,0.82446435678001073,0.26583672151900584,0,0]
[0.96212376701934199,0.52417280685949008,0.21414270063561328,1,0]
[0.22230758568721254,0.39627623095741216,8.7871697231264922E-2,1,1]
[0.69236799178247577,0.29045954879566982,8.0912644953336943E-2,1,0]
[5.7793504042733312E-2,0.49798300810167362,0.19555065332312202,1,0]
[0.48553165308388579,0.76162299487276452,6.8655924508679606E-2,1,0]
[0.55197446584029053,0.89536960924929621,0.15901847301732469,1,0]
[2.4039948947264245E-3,0.55915023900385008,0.25110053507094005,0,0]
[0.33751689702659249,0.43240133798518166,3.0970337858060595E-2,1,1]
[0.79959078228988734,0.6700476494187374,0.11867083990590449,1,1]
[0.80729274357496994,0.59909640585222168,0.10424892790666046,1,1]
[0.47234292989422422,0.33654115000023843,2.7483709170080348E-2,1,1]
[0.63735281439194802,0.60930414154254775,3.0813190979742236E-2,1,1]
[0.90734482582368381,0.86170364387517773,0.2967593331179087,0,1]
[0.15958275482246942,0.62734190477217755,0.13209986152526529,1,0]
[0.10619747324481066,5.6618180128547579E-2,0.35166786827129271,0,1]
[0.11809542403486928,0.40935227711617594,0.15406811480712887,1,0]
[0.501544004831047,0.46190815435595056,1.4533726554883846E-3,1,1]
[0.1530931861802034,0.2567977456645687,0.17949167398843885,1,1]
[0.12055997801530871,0.23974395286259365,0.21170794035533086,1,1]
[0.49957875864888857,0.56820659045525035,4.6523164258061344E-3,1,1]
[0.46454353562288586,0.56737607791274025,5.796696741029209E-3,1,1]
[0.74013052535330759,5.8254621548728958E-3,0.30187114306090046,0,0]
[{"$f":"RAND()","v":9.7017316539392495E-2},0.98999291421782354,{"$f":"(A130-0.5)^2+(B130-0.5)^2","v":0.40248809915278755},{"$f":"1*(C130<0.5^2)","v":0},{"$f":"1*(ABS(A130-B130)<0.25)","v":0}]
[0.35860857708600946,0.92504040828609813,0.20065088314965593,1,0]
[0.44867055063326533,0.54786229851018275,4.9255119909700201E-3,1,1]
[5.9042269755311461E-2,0.36810431311899128,0.21184019208036059,1,0]
[0.4811911582144266,0.75141142151506179,6.3561475397538814E-2,1,0]
[0.77284911629723829,0.94977383115004421,0.27674313945157236,0,1]
[0.20125116161569612,0.20114702245964866,0.17856397062070467,1,1]
[0.43523225861111348,0.43308525356931116,8.67244361450107E-3,1,1]
[7.3050568275014327E-2,0.30987524810843825,0.2184332385321161,1,1]
[0.67320754401498339,0.6318730605464109,4.7391357401579765E-2,1,1]
[0.88908185280432439,0.93747350714531041,0.34276775763566392,0,1]
[0.54909313734366283,0.26448058419329334,5.7879531356176128E-2,1,0]
[0.37930093496654693,0.84558292753653719,0.13399582410467326,1,0]
[0.45078325269756303,0.82206826096856023,0.10615025293834454,1,0]
[0.19905916653673184,0.97329242764610147,0.31457110731270671,0,0]
[7.9095114078987505E-3,0.98688300584187105,0.47920811034042837,0,0]
[8.0486746812666099E-2,0.90443425861667526,0.33955843914263989,0,0]
[0.66850934789950478,0.36152574007620697,4.7570520990958529E-2,1,0]
[0.78462992091697548,0.19936363412368141,0.17139641636852343,1,0]
[0.60306209091046237,8.2768189752329135E-3,0.25241348133995228,0,0]
[0.56192694722412295,0.53925881715783208,5.3762015171313999E-3,1,1]
[0.8946842094395091,0.57861191111440102,0.16195545774994877,1,0]
[0.1338920008272303,0.85426669804396416,0.25953996040126204,0,0]
[0.40469203814747112,0.62842273592731757,2.5576006695540644E-2,1,1]
[0.87797038553118012,7.6829975641517612E-2,0.32193448185414753,0,0]
[0.65936629251348844,0.14411248127589682,0.15205354117309366,1,0]
[0.93846328892427289,0.27852084422209722,0.24130307217838293,1,0]
[0.17046779757580077,0.40971184588008014,0.11674342320892581,1,1]
[6.6661012542402309E-2,0.25429103268912046,0.24815557466775487,1,1]
[2.4215347693959943E-2,0.78287632806899043,0.30639005235177452,0,0]
[0.149488951038102,0.74767437919578639,0.18420059355438823,1,0]
[0.3949180644440119,3.3466382230465941E-2,0.22869582968932253,1,0]
[7.4312821625892589E-3,3.2935755730791216E-2,0.46077295006675789,0,1]
[0.56394561387146569,0.41609337463875096,1.1129363312911587E-2,1,1]
[0.3469940165208647,0.34184269490114361,4.842456413655017E-2,1,1]
[0.91564811680790281,4.6851695678739258E-2,0.37810674271518996,0,0]
[0.27517193962689346,0.87561621523018762,0.19163519787498387,1,0]
[0.53354130322446813,0.5244603030983277,1.7233254496577758E-3,1,1]
[0.15386903882124636,0.10313067596887204,0.27731190264345229,0,1]
[0.26208510371557214,0.62148117148690973,7.1361172899862033E-2,1,0]
[1.1439379684379136E-2,0.36101068778781154,0.25800950863240146,0,0]
[0.41608579635770626,0.20262183009735402,9.5475369507567326E-2,1,1]
[0.98389508683807658,0.66461767813489714,0.26125343502055426,0,0]
[0.35388530913123839,0.38755732691252542,3.3992857618730443E-2,1,1]
[0.96323156051167425,0.23044951296355987,0.287240943715663,0,0]
[0.36613014160021262,0.62033360476136146,3.2401315422842678E-2,1,0]
[0.36930590436496402,0.25075469828316421,7.9204167061776437E-2,1,1]
[3.9004405007565746E-2,0.45302236398026297,0.21472383688843139,1,0]
[9.706266545507225E-2,7.5972234438764774E-2,0.34215804153702489,0,1]
[0.96829795893961157,0.11141651989793255,0.37030009935524,0,0]
[0.30457274151566083,0.79103024830057223,0.12289041878459744,1,0]
[0.31671716542218642,0.41481500673874572,4.0849080527798114E-2,1,1]
[0.52199335697755078,0.53412636119826584,1.648316279776486E-3,1,1]
[0.85254062909853012,0.34070328905547775,0.14966033728293004,1,0]
[0.4721308168917735,0.72895196722253919,5.3195694662190519E-2,1,0]
[0.62298707169286738,0.90953902386325214,0.1828480318704519,1,0]
[0.15248464232415326,0.77399985467802146,0.19584284418414857,1,0]
[2.142116398338767E-2,0.46135267521997492,0.23053131799566826,1,0]
[0.9643579904604116,0.29826884320612213,0.25632380292582785,0,0]
[0.86901357631763199,0.42779241285784642,0.14138495514762051,1,0]
[0.54815945177848813,0.15275321065411562,0.12289966550662952,1,0]
[0.474126337932543,0.37770654787227054,1.5625134822098222E-2,1,1]
[0.73736821925452878,0.55388733192823281,5.9247516054409588E-2,1,1]
[0.55952603175187487,0.18769968502668166,0.10107483518855906,1,0]
[{"$f":"RAND()","v":3.1961553037614165E-2},7.0692880771746069E-2,{"$f":"(A194-0.5)^2+(B194-0.5)^2","v":0.40336459045502426},{"$f":"1*(C194<0.5^2)","v":0},{"$f":"1*(ABS(A194-B194)<0.25)","v":1}]
[0.52294412878979613,0.87491189863726626,0.14108536478572256,1,0]
[0.90061381616602043,0.86148114949130794,0.29116005114065935,0,1]
[0.60023790138057564,0.55035191370332481,1.2582952086769078E-2,1,1]
[0.96705566178388747,0.99866444476317795,0.46680721967535366,0,1]
[0.33820390450893556,0.85277233981811906,0.15062630025690413,1,0]
[0.82314500349957043,0.35547676640338566,0.12530965833595895,1,0]
[0.4587817272119189,0.7519949117504009,6.520038155972499E-2,1,0]
[0.90780971426303325,0.75418967425210248,0.23092115354368681,1,1]
[0.20586004477587816,0.83591018425504993,0.19935396514550999,1,0]
[0.13434448519903119,0.85518157805487494,0.25985790889391269,0,0]
[0.71698148487301305,0.34582944347359523,7.0849525277358966E-2,1,0]
[4.8224755275235398E-2,0.78996599295311176,0.28818114881540502,0,0]
[0.88450485163626991,0.24943316786056591,0.21062771830022126,1,0]
[0.41256109291397602,0.83544746382726986,0.12017056346054586,1,0]
[0.30226391400435682,0.16966549842535339,0.14822044263544659,1,1]
[0.55512271565807791,0.63528214207449851,2.133977174578611E-2,1,1]
[0.87184693465812879,0.12682935093744396,0.27752647613641601,0,0]
[0.254047890495536,0.59509288802917748,6.9535097523425529E-2,1,0]
[0.24569481842108143,0.58893450863981711,7.2580472204892443E-2,1,0]
[0.76356916725825996,0.21661327426297883,0.14977674225316229,1,0]
[5.043427262499145E-2,3.9871758560818038E-2,0.41382734180013464,0,1]
[0.35288940429216853,0.59749424306779297,3.1146654800874939E-2,1,1]
[0.3714914897857049,0.1371774426748088,0.14815464530148925,1,1]
[0.28595252552134143,9.5302258204099988E-2,0.20959658354539296,1,1]
[0.50615374211379982,0.39242112946065955,1.1611081928523328E-2,1,1]
[0.5925333262777609,0.15662422950075516,0.12646933623797663,1,0]
[0.76481767608596618,0.85819923432311351,0.1984350930372365,1,1]
[0.1652517436075428,0.46410326875213859,0.11334497047207144,1,0]
[0.18725238393561738,0.46937683688847998,9.8748849472909239E-2,1,0]
[5.5019178072344133E-3,0.51392227060694273,0.24472218291117609,1,0]
[1.4727840273720538E-3,0.61995589304974685,0.26291880134278151,0,0]
[0.9909647237178888,0.59518951403246478,0.25010740351711969,0,0]
[0.45097715254026749,7.7122735601883985E-2,0.18122842031789432,1,0]
[5.0731884332138932E-2,5.912380197742928E-2,0.39621366173858757,0,1]
[0.54574419861827794,0.16655806914966509,0.11327605295642799,1,0]
[0.87401147556621483,0.10085144167891713,0.29920415546501622,0,0]
[0.56288123093279008,0.63376106851841729,2.1846072654811602E-2,1,1]
[0.66982760457360979,0.64709879754288624,5.0479471513773404E-2,1,1]
[0.61648286735565683,1.2800240344083447E-2,0.25093186419617841,0,0]
[0.69089478106735835,6.8140261667826163E-2,0.22294365103108835,1,0]
[0.17368830633498944,0.97519043779004633,0.33228527358962356,0,0]
[0.8878062805218514,0.31240716157478432,0.18558478424062197,1,0]
[0.20839653260329216,0.40342082204099505,9.4360119813020005E-2,1,1]
[0.97130739750163808,0.3291245876356037,0.25132906949046957,0,0]
[0.5324911798845503,0.8355248723331774,0.11363261672448521,1,0]
[0.39166060123595681,0.51683825559557761,1.2020952176056364E-2,1,1]
[0.49735919265995465,0.44302742844575371,3.2528477729109506E-3,1,1]
[0.24637575205637807,0.4124582056086018,7.1988824910233645E-2,1,1]
[0.73212841026770514,0.90699652691686228,0.21952977177580024,1,1]
[0.62250969070881823,0.39590276385183054,2.5844858891258062E-2,1,1]
[0.68407200759163511,0.87461680044659973,0.1742202511556625,1,1]
[0.62070696622998733,0.76060928417665519,8.2487370695515927E-2,1,1]
[8.1814118357617205E-2,0.73726489821626895,0.23117406353059344,1,0]
[0.86779240835941529,3.6115416239484999E-2,0.35046016269748514,0,0]
[0.62005177395346722,3.4852192605912879E-2,0.23077491115290116,1,0]
[4.761508390619873E-2,0.19863726835227946,0.29547160833537162,0,1]
[0.7052020765860143,0.35994706675186972,6.1722716346617718E-2,1,0]
[0.95269512660118105,0.6027164907666277,0.21548355512387005,1,0]
[0.98068313245400696,5.2610474316856393E-2,0.43121366151678459,0,0]
[0.19825355580388493,0.62511193224143458,0.1067039121741845,1,0]
[0.36177094340219196,0.33824677748493348,4.5271377081928646E-2,1,1]
[2.7406007955628198E-3,0.80776404342434249,0.34198561652205839,0,0]
[0.93487249756495716,0.14120141815224585,0.31785051147434318,0,0]
[{"$f":"RAND()","v":0.6609986628436092},0.73873296817947021,{"$f":"(A258-0.5)^2+(B258-0.5)^2","v":8.2913999533210089E-2},{"$f":"1*(C258<0.5^2)","v":1},{"$f":"1*(ABS(A258-B258)<0.25)","v":1}]
[0.46109632031458003,0.15377135564935263,0.12138777046195282,1,0]
[0.4861384347074621,0.8657130465106212,0.13393817538043906,1,0]
[0.85020685747477964,0.8272052320533404,0.22970810690544097,1,1]
[0.43015488225779419,0.8546248151273752,0.13063709997654763,1,0]
[0.48160376645885339,7.5452858115012233E-2,0.18057869709121233,1,0]
[0.2973911678063097,0.46159207744926234,4.2525507397554417E-2,1,1]
[0.10682808691304757,0.69463336160657174,0.19246629869072859,1,0]
[0.81942385632612502,0.68705849778833228,0.13702248158508049,1,1]
[0.51450577836966105,0.47982384206266526,6.1749495522200187E-4,1,1]
[0.59802315203999701,0.99184993807353783,0.25152489991879934,0,0]
[0.75266728416088224,0.22149564278094735,0.14140543347523371,1,0]
[0.2710099785268496,0.30749351605140829,8.9495176296523288E-2,1,1]
[0.66527010209892368,0.86209193768206183,0.1584247779821388,1,1]
[0.54002798855150058,5.4742867857138888E-2,0.19985615359156436,1,0]
[0.20725293642897691,0.86493538926997637,0.21887868157108581,1,0]
[0.55109417596837174,0.65324014596259328,2.6093157152523829E-2,1,1]
[0.45962049676150363,0.80027044975506345,9.1792847277895828E-2,1,0]
[0.35141520655913139,0.79469651957575593,0.1089234794919295,1,0]
[0.83917147531566738,0.50191108717981392,0.11504094192201522,1,0]
[0.25927102983862871,0.88487634449379537,0.20608023762586106,1,0]
[5.3127033553598269E-2,0.83505882686800914,0.31195986560277339,0,0]
[0.33565169486390289,0.23838417737097017,9.5453204050971671E-2,1,1]
[0.76908078597737684,0.53626300579326069,7.371947497136494E-2,1,1]
[0.71688943444594122,0.15825905636672932,0.16382789932963854,1,0]
[0.65522580626941218,0.53916209933148673,2.5628720956038315E-2,1,1]
[0.52721715192843266,0.62446820114682,1.6233106455820632E-2,1,1]
[0.54630851635184263,0.54620143623113171,4.2790513965282068E-3,1,1]
[0.30243551037241556,0.8970696265039062,0.19669601585375948,1,0]
[0.86677620729616378,0.5488296653917295,0.13690912246082679,1,0]
[0.94549480122378748,0.55082859621399483,0.20104916411050724,1,0]
[0.18956471182702173,0.38398438788717604,0.1098296903969533,1,1]
[0.10983486953710631,0.89936839157559445,0.3117239412188042,0,0]
[0.59405479109578385,0.46052263385926229,1.0404766165481406E-2,1,1]
[0.96867381733948799,0.54565867471491236,0.22173986163628995,1,0]
[0.19139792797525512,0.57305171651816611,0.10057179214421633,1,0]
[0.13795634284050717,0.47858292074014686,0.13153430097344324,1,0]
[0.99712268794478653,4.2389983953174615E-2,0.45653789365582542,0,0]
[0.59323746148211842,0.91993241788927482,0.18503645981796207,1,0]
[0.85362175027304477,0.67268393438294694,0.15486808346014558,1,1]
[0.80531554326175736,0.18064038127890114,0.19520814702690767,1,0]
[0.35010322744950773,0.35471095509671335,4.3577948989963255E-2,1,1]
[0.97208116308230519,0.33442617292284238,0.25027531675011855,0,0]
[0.1538620436097089,0.34799057516570397,0.14291835009250056,1,1]
[0.30745886169591252,0.52270586428779731,3.7587646212489612E-2,1,1]
[0.6730298758324964,0.67361710158389176,6.0082235893000518E-2,1,1]
[0.59876825519812571,0.60010105747502651,1.9775389942500644E-2,1,1]
[4.5790092659700909E-2,1.9779876203193436E-2,0.43691800722550334,0,1]
[0.36928274193584276,0.23124646952774763,8.9315461697111367E-2,1,1]
[0.55043032053700702,0.49381416463256889,2.5814817886582338E-3,1,1]
[0.26206046110697911,0.20937584420832112,0.14107762409824942,1,1]
[0.80624262416106374,0.73008132627630207,0.14672196155411671,1,1]
[0.97076439125382996,0.99669261257458686,0.46832266345875773,0,1]
[0.97435906496733649,0.55081009004929604,0.22759818776750332,1,0]
[0.79987953195494144,0.22954864717496981,0.1630716679304037,1,0]
[0.22857106492550161,0.69578305090257586,0.11200466981639687,1,0]
[0.38506339917687304,0.77821219963371924,9.0612450233807276E-2,1,0]
[0.21926575363083045,0.13598095077057903,0.21132158528635719,1,1]
[0.89827932640387409,0.11719193206666456,0.30516843871557686,0,0]
[0.48249255960380499,0.11313745770122574,0.14996913710309723,1,0]
[0.79534771479433441,0.33614927953123419,0.11407733123236914,1,0]
[2.2696688380630881E-2,0.78986059769376626,0.31183761737820398,0,0]
[0.78043881711191498,0.52170767331732204,7.9117153223981676E-2,1,0]
[0.39017699589961041,0.43324506422031039,1.6517313680584671E-2,1,1]
[{"$f":"RAND()","v":0.42447247907336072},0.9187307463790253,{"$f":"(A322-0.5)^2+(B322-0.5)^2","v":0.18103984438045956},{"$f":"1*(C322<0.5^2)","v":1},{"$f":"1*(ABS(A322-B322)<0.25)","v":0}]
[0.3446740082905374,4.655673412026462E-2,0.22973695907220842,1,0]
[0.8747653734801738,0.68284118685985706,0.1738799847720553,1,1]
[5.9361971027592331E-2,0.37039231275939843,0.21096002516854598,1,0]
[0.87746452184988188,0.28077156770369038,0.19054057078245756,1,0]
[0.35145782141808524,0.8058477328057837,0.11560761448029951,1,0]
[0.83477687395618361,0.34477394261921468,0.13617068422585732,1,0]
[0.89444364189555237,0.80492085196207153,0.2485625125931023,1,1]
[0.46804421877740421,0.88076867193077379,0.14600595347747164,1,0]
[0.19094495862335559,3.2650198171492506E-2,0.31393085586946462,0,1]
[0.95615791460774557,0.13367840137669151,0.34227155667722364,0,0]
[0.34367368219228545,0.29746184641139961,6.5459621298398052E-2,1,1]
[0.56930321017746144,0.35681472994860375,2.5304956500592668E-2,1,1]
[0.18856627139602256,0.85475674197442608,0.22284331328848542,1,0]
[0.21199020259857859,0.6813208540162794,0.11582689550040071,1,0]
[0.24428192499097512,0.49638418703480469,6.5404807989720551E-2,1,0]
[0.86081035824822127,0.73865057686360713,0.18713821245654225,1,1]
[0.14740671387417703,0.23691402042890075,0.19353625806789132,1,1]
[0.58943818833134154,0.82790083845847784,0.1155181493937653,1,1]
[0.19516144722967055,0.33756722991812715,0.1193109480515795,1,1]
[0.5820838743094614,0.22397606099299028,8.2926977326596887E-2,1,0]
[0.58366718049135913,0.7307246654174514,6.0234068323368563E-2,1,1]
[8.4847689041354091E-2,0.7911620977704994,0.25712680847242209,0,0]
[0.60237187911627754,0.81979061130450526,0.1127460367123069,1,1]
[0.78498622051218492,0.51751203150059266,8.1523817129097439E-2,1,0]
[0.33596807298826192,0.82640466455101036,0.13344647811984175,1,0]
[0.37390798583911244,0.4910259606453895,1.5979729417487567E-2,1,1]
[0.86633744731269779,0.76749696855068938,0.20575775348739214,1,1]
[0.63120794238264977,5.2871388719594403E-2,0.21713951916983279,1,0]
[0.78730748975425557,0.27776900124671011,0.13193221047577641,1,0]
[0.76338874210726337,0.69726366547572471,0.10828658318576512,1,1]
[0.33564604742859105,0.65002341591733315,4.9519247049350068E-2,1,0]
[0.79593707366942779,5.3763646947564414E-2,0.28670563435756224,0,0]
[0.14626573407813748,0.73554956354677958,0.18061152777435729,1,0]
[0.84684194395041634,0.72033161899294329,0.16884535641135529,1,1]
[0.66250904818474143,1.2827107149567252E-2,0.26374661827016982,0,0]
[0.68039897425392204,0.94780050639066948,0.23306908343560723,1,0]
[0.54505958581567604,0.68404858053966067,3.5904246272544231E-2,1,1]
[0.32958583070310399,0.13525761740807574,0.16207799475598481,1,1]
[0.7992005026825092,0.49015583761750559,8.9617848338479106E-2,1,0]
[0.15392775645206025,0.19803282031607294,0.21095017536056959,1,1]
[5.5197906695385046E-2,0.53179418285384261,0.19885977227151097,1,0]
[0.82573609655389946,0.14196892776706649,0.23429025328243536,1,0]
[0.15973597154898456,0.55322175513293903,0.11861216427714397,1,0]
[0.63304523422659265,0.8550657111532044,0.14377269358713968,1,1]
[0.91827250755305401,0.81709512092264769,0.27550120628766817,0,1]
[0.86826851210287403,0.34290320160451626,0.16030110107257595,1,0]
[0.52960550998952838,0.25946512429865376,5.873351265040215E-2,1,0]
[0.10973886910434472,0.37972715818588487,0.16676930676599894,1,0]
[0.40145389237253415,0.78223737127160142,8.9369269070827873E-2,1,0]
[0.96764112687617787,0.386275894997542,0.23162139560463157,1,0]
[0.94119213037712945,0.98727460315465487,0.43208703478623639,0,1]
[0.29458367212170289,0.11318347290230757,0.19182289339492387,1,1]
[0.22873418541279256,0.11578698598129156,0.22120478230500146,1,1]
[0.75366528364956453,0.61398748261789537,7.7339222322579032E-2,1,1]
[0.74649895660912613,0.80213212246675125,0.15204555503565181,1,1]
[0.7868987158043782,0.86219887823488783,0.21349890052481246,1,1]
[0.21667570165722028,0.57822202490218533,8.6391343211226559E-2,1,0]
[0.23794841758815011,0.17261627570475235,0.17585113477798128,1,1]
[0.33259765379465978,0.2540324408440956,8.8523585672165922E-2,1,1]
[0.37040555625695537,8.0433212988909042E-2,0.19283100861187932,1,0]
[0.72998490602097488,0.8662914096309533,0.18706245376690747,1,1]
[7.1220072000276358E-2,0.51741973257796325,0.18415567373853595,1,0]
[0.79087413266263062,0.74854806853698297,0.14638390342570243,1,1]
[{"$f":"RAND()","v":0.89601452702038131},0.45483926842875744,{"$f":"(A386-0.5)^2+(B386-0.5)^2","v":0.15886699728722614},{"$f":"1*(C386<0.5^2)","v":1},{"$f":"1*(ABS(A386-B386)<0.25)","v":0}]
[0.33690229069012545,0.54061446222257281,2.8250397323757136E-2,1,1]
[0.25694881243302492,0.3097386128208065,9.5273275229067866E-2,1,1]
[0.91287608193351888,0.91761946130092942,0.34487267349005229,0,1]
[0.29296125415191943,0.58270662920210603,4.9705428796320762E-2,1,0]
[0.20834173438914894,0.68977905285338703,0.12108063280105841,1,0]
[0.86440062632374037,0.17153905706660466,0.24067440749782945,1,0]
[0.25832868000152442,9.8763993112550352E-2,0.21939536013279112,1,1]
[0.83738077605336203,0.27046692269697703,0.16651122162656434,1,0]
[0.24283382942811416,0.91746567166308912,0.24041202630372241,1,0]
[0.98223483515396048,0.31432903941608514,0.26702414184012113,0,0]
[0.80937863097517382,0.59079874294150891,0.103959549023831,1,1]
[0.37489508093802204,0.23013587523606172,8.8477886608110512E-2,1,1]
[0.96607589031736496,0.46547939031878538,0.2184184080278872,1,0]
[0.76621463582835814,0.43006672994251294,7.5760894590158764E-2,1,0]
[0.71852296609544597,0.86001214744173315,0.17736103301675962,1,1]
[0.50788084365387409,6.2676017595139744E-2,0.19131437328314335,1,0]
[0.76561314991393503,0.6937423469784092,0.10808644241990482,1,1]
[0.60442852904672095,0.46263035408277886,1.2301808114840324E-2,1,1]
[0.61723438471895564,0.24844713090537685,7.7022746910168707E-2,1,0]
[0.76876482739041296,0.25279035396216942,0.13334714153634797,1,0]
[0.55564538567009969,0.50523477229734859,3.1238117873792241E-3,1,1]
[0.86296082186187473,0.73598109057931504,0.18742763331765044,1,1]
[0.82947613112061902,1.9646171796969591E-2,0.33929432124751779,0,0]
[0.89124740964581528,0.71066424999699918,0.19745396178135854,1,1]
[0.66071186036055218,0.28066006496978235,7.3938309159609722E-2,1,0]
[0.19954762917009394,3.2115000432605401E-2,0.30918799995749224,0,1]
[0.44152570621056875,0.69232184212151704,4.0406933991186444E-2,1,0]
[0.44820040053265453,0.97277637409607887,0.22620069840841292,1,0]
[0.18767567286910336,0.83451517569798916,0.2094468880900239,1,0]
[0.15734975439527887,0.91379838927548995,0.28863829777996564,0,0]
[0.46370185772693817,0.39713600963528262,1.1898555646228109E-2,1,1]
[0.71740299491975235,0.47650246897476622,4.7816196164359691E-2,1,1]
[0.22902208747524277,0.20281609723522853,0.16174730113877611,1,1]
[0.32460756721111017,0.39873409455562991,4.1017289085073336E-2,1,1]
[0.38118445618581243,0.81742705764577672,0.11487707037751638,1,0]
[0.79774589554773123,0.70608655417115151,0.13112428612565943,1,1]
[0.81857138168565158,0.1175836019829799,0.24773002670141703,1,0]
[0.54767284904393898,7.6228287091961722E-4,0.25151099874022187,0,0]
[0.47904290256462079,0.99913190591712986,0.24957185943738255,1,0]
[0.80257217629473399,0.80958804724147915,0.18739468086252392,1,1]
[0.16659300503515417,2.4293705960410916E-3,0.35873675553694051,0,1]
[0.28804861316131014,0.77247292327749328,0.11916488430222669,1,0]
[7.642796392841622E-2,0.27346602204117454,0.23073091291167669,1,1]
[0.62811329180038633,0.38712272529918801,2.9154294679813505E-2,1,1]
[0.25083889470758658,0.47747540464962079,6.2588613786235453E-2,1,1]
[0.65970597901377293,0.1172440700425974,0.17200810165030375,1,0]
[0.81343357712695286,4.5641866885675286E-2,0.30468192039773195,0,0]
[0.61204026624148,0.38490715302626466,2.5799384683981384E-2,1,1]
[0.65687142516386421,0.51398449564155191,2.4804210151290435E-2,1,1]
[0.78323374593760031,0.24703129994661399,0.1442145180445451,1,0]
[2.3538442186755715E-3,0.24116288247768336,0.31464834977119177,0,1]
[0.99270821672886478,0.84945185191919215,0.364877983641891,0,1]
[0.97391519897176404,0.77780874956547286,0.30177331715157829,0,1]
[0.64636830253458621,5.8452360301128659E-2,0.21638799811050047,1,0]
[0.25578628651595481,0.42523518662527005,6.5230115172625516E-2,1,1]
[0.84372146465199072,0.42077994308518063,0.12442026268009693,1,0]
[0.18405902170830102,0.20961020714176515,0.18414493356016434,1,1]
[0.20246868238197402,0.22221800235260858,0.16568772318049402,1,1]
[0.61681924975241409,0.55224042036236998,1.637579863235402E-2,1,1]
[0.95745045974742837,5.6967958091059478E-2,0.40553831328113882,0,0]
[0.57182550854859027,0.71423945859561888,5.1057449297607506E-2,1,1]
[0.73267512277987124,9.3366468761785115E-2,0.21948854148788843,1,0]
[0.56271100967188969,0.42811827592721186,9.0996529897442932E-3,1,1]
[{"$f":"RAND()","v":0.70805583624141144},0.78884435389551455,{"$f":"(A450-0.5)^2+(B450-0.5)^2","v":0.12671829177143026},{"$f":"1*(C450<0.5^2)","v":1},{"$f":"1*(ABS(A450-B450)<0.25)","v":1}]
[0.52518444717302937,0.75159922036640114,6.3936424068391992E-2,1,1]
[0.96898067772784313,2.3468934925991558E-2,0.44702473206263593,0,0]
[0.79891881130479758,0.17617449189867274,0.19421541544895596,1,0]
[0.95994608725432062,0.80952581809308111,0.30735663524675028,0,1]
[0.32646387418257816,0.56566807242917128,3.4427082700282947E-2,1,1]
[7.7973098461773249E-2,0.91383658337584017,0.34936742336214488,0,0]
[0.34823744406933077,0.89007259331888378,0.1751885014411288,1,0]
[0.35437221282738751,0.16391688549325045,0.13415931225334865,1,1]
[0.77339458542575013,0.58122578464702002,8.134222743164185E-2,1,1]
[0.51576885966337493,0.17459563952161528,0.10613665475342977,1,0]
[0.31548147858832243,0.65712500570883803,5.8735352162954099E-2,1,0]
[0.85548200555343079,0.37189909397661025,0.14277729839630274,1,0]
[0.43175050667512016,0.29309604814482504,4.746723863239137E-2,1,1]
[0.48551011330153504,0.52191676362104278,6.9030134415501594E-4,1,1]
[0.89014260941871548,0.38526976095450349,0.16537428343548116,1,0]
[0.27429173354207814,9.6419669765861471E-2,0.21382130449933656,1,1]
[0.4643546968705019,0.39392347463757948,1.252281686815805E-2,1,1]
[0.15156284269474951,0.16098116391166883,0.23634222381365061,1,1]
[0.23348464982267658,0.72118757229401631,0.11995437401746202,1,0]
[0.1075155465569223,0.70792406268169172,0.19727646203657151,1,0]
[0.22486739112514087,0.2033623560932688,0.16369184424882288,1,1]
[0.54453065641114173,0.67257872278636188,3.1766394918979105E-2,1,1]
[0.58073875905438155,5.211130184732149E-2,0.20712303314654265,1,0]
[8.1069553550572326E-4,0.62944199971622938,0.26594519298228192,0,0]
[0.67152260220447835,6.9184673174734757E-3,0.27254940093954522,0,0]
[0.12551788304006095,0.35909014332070466,0.16009244363217703,1,1]
[0.74504436447377831,0.24950272912295457,0.12279562327720578,1,0]
[0.53893012729146184,0.50754554556107123,1.5724900687436234E-3,1,1]
[0.60731932877290051,0.85526690772314029,0.13773201405142818,1,1]
[0.73126440373497881,0.6494069319666983,7.5805655754596898E-2,1,1]
[0.32866336879813385,0.61858433657075718,4.3418486071530912E-2,1,0]
[6.0630024814408823E-2,0.6861308123668276,0.22769065440692221,1,0]
[0.26111327503247739,0.35372429099134739,7.8463450411692809E-2,1,1]
[0.9411380483404812,0.21923132105900589,0.27343382876791977,0,0]
[0.26061295448655819,0.52228145482271038,5.7802620788671141E-2,1,0]
[0.46763961749573613,0.17472693309171894,0.10684976241174135,1,0]
[0.83792421082268631,0.84401084083211197,0.23253623087015202,1,1]
[0.7848833367500655,0.84465459120639308,0.19994530279749714,1,1]
[0.17350248952771974,0.51552095968610634,0.1068415245341745,1,0]
[0.56143806274480479,0.60240592641934165,1.4261609319638187E-2,1,1]
[0.63778557784345502,0.97016942963070196,0.24004415802091442,1,0]
[0.59847157645885041,0.73013280647557055,6.2657759986613631E-2,1,1]
[0.24408655408976743,0.97035753607836683,0.2867279035433617,0,0]
[0.92423264097091251,0.85908364189591457,0.30891439554238859,0,1]
[0.90753337978776716,0.38772358053743761,0.17868945000857372,1,0]
[0.77009970172742626,0.56542366936214239,7.7234105386051563E-2,1,1]
[0.59240100230100923,0.35129876390107417,3.0650002843579594E-2,1,1]
[0.33090385053337956,0.38312349854161343,4.2253624357589878E-2,1,1]
[0.60970074392766416,0.16932305552618399,0.12138149482482215,1,0]
[0.52268112016604384,0.42248051671099307,6.5237035013811454E-3,1,1]
[1.882965366293754E-2,0.75021906560059026,0.29413448298416112,0,0]
[0.69298812510509789,0.93109352930475375,0.22308604744000948,1,1]
[0.50556759201547385,0.76874545086569035,7.2255115441853965E-2,1,0]
[9.6564387800160412E-2,7.3001757457069605E-4,0.41203080854214785,0,1]
[0.35930759703060744,0.42893710649484762,2.4844287086626567E-2,1,1]
[0.54771216438742687,0.83639709763648384,0.11543945792878289,1,0]
[0.61081649240344738,0.30963919244833482,4.8517532040325412E-2,1,0]
[0.87623168612262947,0.19233981792830168,0.23620506927506735,1,0]
[0.39017868352888996,0.56759767682841855,1.6630167464047017E-2,1,1]
[0.11482967676444422,1.992222966193069E-2,0.37883084347415452,0,1]
[0.64347651224730584,0.29825152640383557,6.1287956165033561E-2,1,0]
[0.92234164820291653,0.6889839867718679,0.21408741506294565,1,1]
[0.1393629559079651,0.34789428366910669,0.15319522651197451,1,1]
[{"$f":"RAND()","v":1.8319850562406925E-2},0.52054212396704824,{"$f":"(A514-0.5)^2+(B514-0.5)^2","v":0.23243774521929955},{"$f":"1*(C514<0.5^2)","v":1},{"$f":"1*(ABS(A514-B514)<0.25)","v":0}]
[0.28056060039522734,0.23965142468005041,0.11593503077003056,1,1]
[0.38250187202595809,0.21732825147150403,9.3709127493561598E-2,1,1]
[0.3298299648430707,0.26356894158929067,8.4857486246518801E-2,1,1]
[9.1233134808740068E-2,0.71990917128107601,0.21545039369181931,1,0]
[0.8432078814506303,5.5753145731007869E-2,0.31514691741772505,0,0]
[0.30394418169972959,0.38705865586094512,5.1193631105325071E-2,1,1]
[0.95956387405646471,0.63851849428751561,0.23038632759746666,1,0]
[0.49581920679038927,0.6112390364021425,1.239160225153871E-2,1,1]
[0.34849324917524649,0.69177335745104795,5.9731316173521364E-2,1,0]
[0.80828713206868097,0.5745666242299442,0.10060113724818204,1,1]
[0.95507704412155114,0.97592268627261025,0.43359751939534563,0,1]
[0.79141729332015021,0.31312300434114815,0.119847050352521,1,0]
[0.99969556337293319,0.76274562851488681,0.31873092135827596,0,1]
[0.98704856770885818,0.59007517445335733,0.24532984436005298,1,0]
[5.8809231323826761E-2,0.15918200915620195,0.31080619724787584,0,1]
[0.35578525013379236,0.11084661919370253,0.172238247871944,1,1]
[0.77848470141621884,0.96820975397076303,0.29677410263624299,0,1]
[6.7528806084427462E-2,0.27966317084012049,0.23557965185099067,1,1]
[9.1083932800429146E-2,0.95320286249478681,0.37260518458743258,0,0]
[0.37012062995638395,0.96389840134968974,0.23207037753772436,1,0]
[9.4802079422678931E-2,3.993122536176974E-2,0.37584863223730769,0,1]
[0.96691719241564311,0.46899566068538268,0.21897293362964262,1,0]
[0.94493570959376827,0.89638813395173311,0.35509133840944718,0,1]
[0.79835551620540335,0.69513421558112765,0.12709337614065469,1,1]
[5.6082571497625855E-2,0.34101722416797442,0.22233820633941656,1,0]
[0.14491338741285942,0.47544821083694577,0.12668929278971713,1,0]
[0.7163035258658268,0.56636334261115684,5.1191308544514189E-2,1,1]
[0.72764355126160962,0.72915904347920579,0.10433545363930162,1,1]
[0.53041899765289802,0.79728091845491711,8.9301259895606097E-2,1,0]
[0.34818301253224149,0.52125087175564611,2.349999723416046E-2,1,1]
[0.47008541801926418,0.31261146683399132,3.6009344577190502E-2,1,1]
[0.26638337724976502,0.11192509437683507,0.20517885879965397,1,1]
[0.17408324007381948,0.21381956474068298,0.18812097592599172,1,1]
[0.31055275779566072,0.45555382797976973,3.7865719786081491E-2,1,1]
[0.45528997292552087,0.61661423310658392,1.5597865884037351E-2,1,1]
[0.89836556491662589,0.20141494165059748,0.24784816038085858,1,0]
[0.26381257743047493,0.92062747505047049,0.23271197134736957,1,0]
[0.49637242037022244,0.68745553697586625,3.5152737676880735E-2,1,1]
[0.28187576471894338,0.58266584868430216,5.441182455564169E-2,1,0]
[0.61935600883698139,0.40694897842599875,2.2904349461458827E-2,1,1]
[0.10830888080463585,0.48930957247490703,0.15353621809718621,1,0]
[0.52932841194384206,0.42358332067681304,6.6996646259304873E-3,1,1]
[0.17239817535572488,0.56127215563868249,0.11107723256686931,1,0]
[0.9380987372689823,0.53058384339779963,0.19286587507365791,1,0]
[0.78511114706478102,0.33811649529895715,0.10749463527488776,1,0]
[0.65675963755185152,0.43512164314583801,2.8782785153483842E-2,1,1]
[0.63362468043466402,0.76030476378796963,8.5614125271976746E-2,1,1]
[0.57517457793626814,0.6340741643545752,2.3627098715273694E-2,1,1]
[0.12907378255955937,0.25559159901383899,0.19732172525728511,1,1]
[3.3728110018427904E-2,4.509232262502616E-2,0.42435047032168055,0,1]
[0.96851803853697183,0.58495033825392206,0.2267257124039872,1,0]
[0.29722778872361466,0.21982320934325594,0.11961560368862803,1,1]
[0.19728207738532288,0.76087006890576792,0.15969133352304574,1,0]
[0.99354899720691769,0.48329621684244051,0.24386962901572881,1,0]
[0.53340693804283046,6.7104158717179452E-3,0.24445063731885097,1,0]
[0.50007240490590932,7.6668998930057519E-2,0.17920914170935004,1,0]
[0.53521198868806075,0.24163381753791791,6.7992968387398017E-2,1,0]
[0.20052791079055943,4.5261356250781204E-2,0.29647076633434605,0,1]
[1.3010976906963845E-2,0.68554905565945878,0.27158676066922666,0,0]
[0.67270103022084071,6.6438960610047171E-2,0.21780082071623597,1,0]
[0.9535040111013745,0.11983219775680065,0.35019344594745994,0,0]
[5.2431891428512567E-2,2.4965352900498505E-2,0.42597512775520668,0,1]
[0.74672146433604802,0.75030189274047421,0.12352251847358767,1,1]
[{"$f":"RAND()","v":0.42327847231378923},9.7562901178331107E-2,{"$f":"(A578-0.5)^2+(B578-0.5)^2","v":0.1678418113185077},{"$f":"1*(C578<0.5^2)","v":1},{"$f":"1*(ABS(A578-B578)<0.25)","v":0}]
[3.5788706459066066E-2,1.2574499122499749E-2,0.45307574395662914,0,1]
[0.71831974411607347,0.29611425903259536,8.9232906040735416E-2,1,0]
[0.37355642600505679,0.49669331498746205,1.5998911570386822E-2,1,1]
[0.36939544905917088,0.86826532315286831,0.15267689696334213,1,0]
[0.23314694295407212,0.56538364021660548,7.5485574462731742E-2,1,0]
[0.94818532997282345,0.63926812023819923,0.22026569931753015,1,0]
[6.5456498401291752E-2,0.78938753358481495,0.27257319937596897,0,0]
[0.30413597258418523,0.71832677257326127,8.6029296857799586E-2,1,0]
[0.99474640916271073,0.91436198145115555,0.41646986105152417,0,1]
[0.97007104308031633,0.28233359057975949,0.26834545133251642,0,0]
[0.6187468499691352,0.25171263139816524,7.5747431784815661E-2,1,0]
[0.83531187229806958,0.43250026809699482,0.11699026551101449,1,0]
[0.83985035202418101,2.9486805954921258E-2,0.33688092754146171,0,0]
[0.26983523371061424,0.96074672105041281,0.26526336059975447,0,0]
[0.45618108015670289,0.10903392422539571,0.15477457014282694,1,0]
[0.28282721556256174,0.48385012300521735,4.7424836827256636E-2,1,1]
[0.85986814531210787,0.35443560652289063,0.15069407465873511,1,0]
[0.9806354366835528,0.19854139912285662,0.32188771103879432,0,0]
[0.37182260233386011,0.89669276750355509,0.17379459706209338,1,0]
[0.28074124586341997,0.26751659598206701,0.10212293440929071,1,1]
[0.14445089956231671,0.47561374943425849,0.12700985203870091,1,0]
[0.86232811886341532,0.2873319208941183,0.17650937758968677,1,0]
[0.453189998299523,0.61586310831355962,1.5615436127278306E-2,1,1]
[0.72498444232664805,0.10201549969620416,0.2090096617710949,1,0]
[0.64752107975441497,0.83946132396496553,0.13699645943995575,1,1]
[0.2054748229130563,0.38300578196646562,0.10043272699137373,1,1]
[0.61431729605116892,0.41119583668926052,2.0954623597771088E-2,1,1]
[0.89807925471084926,0.21119477645764295,0.24187555017649603,1,0]
[0.18571283658580129,0.21766252729532209,0.17849086958020799,1,1]
[0.963557118017072,0.81973882967149503,0.31711812086399094,0,1]
[0.66987961323432454,0.93415548197092713,0.21735006551805172,1,0]
[0.4085012015031233,0.45092042882167771,1.0780834433420049E-2,1,1]
[0.16287865168596694,0.8067896078471718,0.20777066697209307,1,0]
[9.193072815451131E-2,0.53039032266987196,0.16744410233648629,1,0]
[0.19115612652059188,0.52100751505833121,9.5825853874690656E-2,1,0]
[0.31684772523094884,0.59850653648449414,4.324829348324899E-2,1,0]
[0.65261909504657689,0.2496266350180838,8.597941006520389E-2,1,0]
[0.33238108303503455,0.40847140419577765,3.6473585174400691E-2,1,1]
[0.48311980980042846,0.55513693166784328,3.3250220549181303E-3,1,1]
[0.91149919751189545,0.47331122076032495,0.17004388049023805,1,0]
[2.7677484513239037E-2,0.48004870430134339,0.22348661283579679,1,0]
[0.54550039126328376,2.1978959823415689E-2,0.23057440045661554,1,0]
[6.1369244765525077E-2,1.430127769663625E-2,0.42830018828468591,0,1]
[0.80682448939215523,0.14040244702172977,0.22345166739871664,1,0]
[0.93187834033172201,0.63545501446742381,0.20486696179205269,1,0]
[7.9929780541092121E-2,0.81197693996730858,0.2737886003476207,0,0]
[0.36596156278868164,0.91423640411844354,0.18955810114703101,1,0]
[0.3296992514947652,0.87453585023391189,0.16927944805188253,1,0]
[0.44197438844952486,0.87909137527710968,0.14707724240529702,1,0]
[0.35997578747564329,0.34108772100087348,4.4859892509762439E-2,1,1]
[0.55144678062329733,0.80699574094776416,9.6893156196568409E-2,1,0]
[0.54559327840041505,0.64401348653406598,2.2818631338995359E-2,1,1]
[6.4166558974423804E-2,0.13442996354619507,0.32359223986903068,0,1]
[0.36959563415646635,0.19749742728348896,0.10851310513116222,1,1]
[0.30925489735202993,0.50332024939817133,3.6394718240250694E-2,1,1]
[0.35416371916547595,0.60467406586487804,3.2224880872330997E-2,1,0]
[0.43658816408030976,0.53986217655449509,5.6100540543674547E-3,1,1]
[0.76137754421045134,0.15508809863025941,0.18728244032397612,1,0]
[8.4177341480783374E-3,0.31986271365064689,0.2741025660334182,0,0]
[0.98212666516293479,0.83960561882073603,0.34777809759574774,0,1]
[0.76723105587486606,0.95691829215862367,0.28018676293314915,0,1]
[0.92746385016775312,0.67504186282076728,0.2133649969400036,1,0]
[0.22473471956897295,0.83678956353151313,0.1891981847145191,1,0]
[{"$f":"RAND()","v":0.49456465810735928},0.81629895638135996,{"$f":"(A642-0.5)^2+(B642-0.5)^2","v":0.10007457274942734},{"$f":"1*(C642<0.5^2)","v":1},{"$f":"1*(ABS(A642-B642)<0.25)","v":0}]
[6.525449519936366E-2,0.17901121529423536,0.29203745385124386,0,1]
[0.8894494562203269,0.10777395448795024,0.30551214972832885,0,0]
[0.57120615095932359,0.94969460300122222,0.20729555190286886,1,0]
[5.0022549164751018E-3,4.1185767581967903E-2,0.45553326750712231,0,1]
[7.9472212412790677E-2,0.88464353068976842,0.3247942658344839,0,0]
[6.4081679312340878E-2,0.66178792277394027,0.21620011426665531,1,0]
[0.71981500508383545,0.26936420362132485,0.10151150703123231,1,0]
[9.5107699745166863E-2,0.98713822230340986,0.40124142243457628,0,0]
[0.23382378473837406,0.46042197212694647,7.2416197861323625E-2,1,1]
[0.48082985515789511,0.26112242939563501,5.7429988191110656E-2,1,1]
[0.54302669323670982,6.566507540776001E-2,0.19049812305143274,1,0]
[0.46604638519161878,0.36739337263470317,1.8737365579754611E-2,1,1]
[0.13623554190913811,0.88674017325204657,0.2818925425771614,0,0]
[0.93887463760089962,0.20881960645460262,0.27739696911457346,0,0]
[0.6756365761590295,0.48503607022694206,3.1072126079119577E-2,1,1]
[0.99385078753496192,0.95079819335556204,0.44710761148154082,0,1]
[0.10601275463639259,0.66240129709404239,0.1816001308070308,1,0]
[0.74450050242616106,0.17157978789764461,0.16764033140400131,1,0]
[8.994652965801353E-2,0.67785235257021415,0.19977530785426612,1,0]
[0.98340917699179009,0.45234900722204741,0.23595504951260435,1,0]
[0.42831095474241376,0.13272977376832273,0.14002673828621165,1,0]
[0.94067697518776583,0.81123561303936631,0.29106380328462894,0,1]
[0.14115775536690145,0.87278000911413223,0.26773269172845304,0,0]
[0.94246016192572257,0.33714564300715888,0.22229253648288838,1,0]
[0.32735131710940502,0.82252203152500436,0.13382802852287312,1,0]
[0.41505424978444827,0.81251613149597679,0.10488211292489356,1,0]
[0.35250830811778044,0.71340329482976572,6.7294765418479507E-2,1,0]
[0.79095912419719983,0.81393057251413392,0.18320961631265345,1,1]
[0.78136739660647547,0.11779275823177604,0.22524998753317926,1,0]
[0.22710941999784195,0.72832285883414449,0.12660059652011091,1,0]
[0.7233721583597108,0.14001602795944079,0.17948358125637384,1,0]
[0.54828396536477531,0.30065150240072325,4.2071164806435676E-2,1,1]
[0.30441521453716203,0.33207193425100179,6.6453243570744225E-2,1,1]
[0.98632543655954297,0.1015799332597509,0.39525097982613455,0,0]
[0.12918525036560902,0.18385770755881237,0.23744952761638546,1,1]
[0.50824305862295538,0.23393832373750723,7.0856763591068989E-2,1,0]
[0.34340480530715001,0.13705293748368574,0.1562526251901129,1,1]
[0.75312740312166238,0.34651171750348753,8.7632135074845782E-2,1,0]
[0.26257088520435379,5.6481262299377444E-2,0.25308145524419778,0,1]
[0.45535101166823155,0.73894493596560651,5.9088214582658193E-2,1,0]
[6.4935090436019416E-2,0.36547752319277549,0.20737777230026486,1,0]
[0.92806303768291498,0.85632462139867938,0.31020520004523688,0,1]
[0.96793920076627082,0.25663070711578073,0.27819570833274121,0,0]
[0.56513240645423568,0.64679186504247965,2.5790082013169319E-2,1,1]
[0.79027161376516719,0.26283239687349824,0.14050608173060425,1,0]
[0.44809698211945359,0.35215062814893505,2.4553360021862796E-2,1,1]
[0.55178493141306506,0.2234951240541333,7.9136625543294981E-2,1,0]
[3.9560145134034053E-2,0.29582406504689329,0.25369267236296705,0,0]
[0.38987652238466963,0.95716263071895924,0.22112485124797365,1,0]
[0.98985273613911418,3.7994060972212029E-2,0.45340519079992475,0,0]
[0.2022124936573042,0.33754272540696106,0.11506976500199914,1,1]
[0.3783238328759837,0.16245237610679408,0.12874348804194075,1,1]
[0.21859470028240913,0.790956578263181,0.16384467314376572,1,0]
[0.37285843438609845,0.10666453902922279,0.17087776256384785,1,0]
[0.47801814418464761,0.29212238598730467,4.3696304392698095E-2,1,1]
[0.96471399264158098,0.20487820312937455,0.30305596994502609,0,0]
[0.27637120789212366,0.14910048193742753,0.1731403084361734,1,1]
[0.69222568584799882,0.61575700258561883,5.0350397947340496E-2,1,1]
[0.80928481776024619,0.22133356337396115,0.17331208139884283,1,0]
[0.8705290762472101,0.68410202619176375,0.17118535239252369,1,1]
[0.55124120392437959,0.61453106333148921,1.5743025447461447E-2,1,1]
[0.126485048802362,0.51405581035455705,0.13971098457289716,1,0]
[0.80066080166335252,0.99121720706270666,0.33169126217133582,0,1]
[{"$f":"RAND()","v":0.71560294098711963},0.38661190863679518,{"$f":"(A706-0.5)^2+(B706-0.5)^2","v":5.9341487425285874E-2},{"$f":"1*(C706<0.5^2)","v":1},{"$f":"1*(ABS(A706-B706)<0.25)","v":0}]
[0.46519501658327767,0.72869936480448216,5.3514786332611933E-2,1,0]
[0.48335986641390438,0.53738280249934633,1.674367968468242E-3,1,1]
[0.80360588682235046,0.73519901694047096,0.14749511208294983,1,1]
[0.56741805598813344,0.87232366201410083,0.14317010356880949,1,0]
[5.5576012111950068E-2,0.32611043501489956,0.22775026182102501,1,0]
[0.72970588473664666,0.59923926224978374,6.2613224654526956E-2,1,1]
[0.57192360119341601,0.60391619475001435,1.5971579939952463E-2,1,1]
[0.68650317045925702,0.39142447206780684,4.6572077857109137E-2,1,0]
[0.49444988591002415,0.63235023583999039,1.7547388693312828E-2,1,1]
[0.51337034175154383,0.12524547259905072,0.14061972184606192,1,0]
[0.67382088722133071,0.40673532426413572,3.8912000574526484E-2,1,0]
[0.8045762194564875,0.27411350741788176,0.14379138098945779,1,0]
[0.65961322073775153,0.93386031749599896,0.21371115533200721,1,0]
[0.65153737368055942,0.22159219104193595,0.1004744837108314,1,0]
[0.14650495199371538,0.68352855960890679,0.15864148115708551,1,0]
[0.1413710468108712,0.34765079207463379,0.1518250072210168,1,1]
[0.63306980731538176,0.32559974297904859,4.8123023267926737E-2,1,0]
[0.48420258958558582,6.6751001091848505E-2,0.18795425323071691,1,0]
[0.28439473281942595,0.76268062392364766,0.11548674142092355,1,0]
[0.79950973649903501,0.33083837398096105,0.11832173797512657,1,0]
[4.5195665127573115E-2,0.20080531790807243,0.29636444081084024,0,1]
[0.96816406423926438,0.56230392410773355,0.2230593700042483,1,0]
[0.67147373527168552,0.52244628682901184,2.9907077680434359E-2,1,1]
[0.38760681893261439,0.89355698831597552,0.167519330202787,1,0]
[0.87467317676598788,0.1052138933782546,0.29623605936947334,0,0]
[0.89349004578894364,0.40615689793297116,0.16364094394054776,1,0]
[0.4290989980090878,0.38933767603778902,1.7273102028032672E-2,1,1]
[0.87340427047881175,0.55061433516407221,0.14199256013591466,1,0]
[5.9608197257714046E-2,0.44174895538917147,0.19733812412085325,1,0]
[0.15899941572381948,0.43403552258300238,0.12063271075759409,1,0]
[0.11054794670032242,0.92112682565150605,0.32902070510264891,0,0]
[4.915331319519034E-2,6.3694787682972653E-2,0.39362497329788049,0,1]
[0.61581859002269035,0.42399158379343804,1.919122512907398E-2,1,1]
[1.9945227848399694E-2,4.5866001082868202E-2,0.43669027323799037,0,1]
[0.25015608155422264,0.86023133368855675,0.19218859735537658,1,0]
[0.92100527606756533,0.81674575051712617,0.27757331294738441,0,1]
[0.9286146401120936,0.58268775758161706,0.19054777497229577,1,0]
[0.3695207842412207,0.52793931227151603,1.7805430915231367E-2,1,1]
[0.42663341996296056,0.10829960745097089,0.15881185258939481,1,0]
[0.12857080864458759,0.80152277499848545,0.22887562803372286,1,0]
[0.64525603547377719,0.868458544954964,0.15686101519188844,1,1]
[0.38793585519155527,0.50736747558648931,1.2612652248165587E-2,1,1]
[0.71411411323691532,0.41395743965418963,5.3248175678093014E-2,1,0]
[0.57537501838119054,0.45695297138198487,7.5344400688050258E-3,1,1]
[0.63823403974700776,0.29438714921517561,6.1385294152639783E-2,1,0]
[0.79553960008725488,0.34466727386563079,0.1114719110280695,1,0]
[0.63395266156770202,0.68927407188024314,5.3767989827198763E-2,1,1]
[0.80409044134749419,0.6195239313189479,0.10675696667685038,1,1]
[0.35860078915241511,0.17171728916758466,0.12776327505979898,1,1]
[4.2590429426676679E-2,0.34833703746195865,0.2322251694578874,1,0]
[0.24019309831847568,0.74324693990489255,0.12666869993444765,1,0]
[0.95364404742621323,6.275493522512765E-2,0.39697616843521871,0,0]
[0.76194677618058004,0.81139735417637593,0.16558442573944621,1,1]
[0.49240372745085192,0.29175504867298585,4.342366310983143E-2,1,1]
[0.50765932261956126,0.81178127070804995,9.7266225987316851E-2,1,0]
[0.92583271396591493,0.42837468374327314,0.18646368621245288,1,0]
[0.37737021665938986,0.77402532355421849,9.0127941711159121E-2,1,0]
[0.99175555943257565,0.24918363847450664,0.30473237744173243,0,0]
[0.10026623216046637,6.9524062662419506E-2,0.34509661777785872,0,1]
[0.15742665467676864,0.74066448223736125,0.1752758899365271,1,0]
[0.92740726424460862,0.21433639594607989,0.26428066421013552,0,0]
[0.64905566538607806,0.88054996052167889,0.16703586383673785,1,1]
[0.75132698083578353,0.98638479121884337,0.29973541642502816,0,1]
[{"$f":"RAND()","v":0.72962587628499243},0.32620020931952143,{"$f":"(A770-0.5)^2+(B770-0.5)^2","v":8.2934410300228814E-2},{"$f":"1*(C770<0.5^2)","v":1},{"$f":"1*(ABS(A770-B770)<0.25)","v":0}]
[0.75395389037433724,0.91357244644004276,0.23553474689066295,1,1]
[5.1921601680462115E-2,0.94610676805136684,0.39978549954183851,0,0]
[0.6105964183005419,0.72789632272157845,6.4168301650926268E-2,1,1]
[4.0623244759147137E-2,0.21859396016040378,0.29021636251381888,0,1]
[0.41118196208990365,0.64015315617241109,2.7531551043287562E-2,1,1]
[0.96970558694458775,0.29300057016976,0.26347210235700413,0,0]
[9.8488169181115914E-2,0.34205891632256502,0.18615713620073474,1,1]
[7.4256973882317556E-2,0.34342952735335619,0.20577143719263508,1,0]
[0.73035192966121887,0.37860330359694427,6.7799169396222811E-2,1,0]
[7.6368551656962436E-2,8.7655736741405588E-2,0.34949139546749275,0,1]
[0.41229522089054904,0.15307426726790552,0.12804959231033824,1,0]
[0.6226806403235744,0.97171784518878546,0.23756826497975317,1,0]
[0.1057709073401909,0.86854946525932397,0.29124528584231002,0,0]
[0.85953064179950822,0.56211544016340853,0.13312061029946029,1,0]
[0.91321838050908755,0.89104479676882176,0.32366546307052219,0,1]
[0.25099698355118993,0.19898485064272842,0.1526126223431869,1,1]
[0.50136989283059952,8.3176398257328032E-2,0.17374379157610093,1,0]
[0.78598176864817881,0.37618770855779726,9.7115055511309417E-2,1,0]
[0.96599932362893715,0.14487732109012574,0.34326748669875257,0,0]
[0.44456464571073118,4.9637394045573768E-2,0.20589955534723856,1,0]
[0.90141696499372981,0.89657093163963297,0.31840408360630379,0,1]
[0.33926606623089084,0.69203645192755547,6.2713396333816701E-2,1,0]
[0.94010382151923677,0.15483719233445048,0.31282873751140133,0,0]
[0.21795100099388043,0.71173370802249969,0.1243828009533112,1,0]
[0.93602335140312709,0.61169324107428436,0.20259174307049305,1,0]
[0.60594389552445727,0.50434427826541783,1.1242981752544498E-2,1,1]
[0.45182499753129157,0.76018664255250512,7.0017919825605124E-2,1,0]
[0.93713936324783853,0.73768822865449579,0.24758651694163761,1,1]
[0.91491405129419456,0.92292924420405453,0.35102281556437431,0,1]
[0.50722721757102729,0.67301101417869513,2.9985043700959613E-2,1,1]
[0.64336089282749054,0.19511827595215647,0.11350521125068064,1,0]
[0.61568359458148725,0.36099396403129147,3.2705372091027793E-2,1,0]
[0.67167842997720129,4.6695458260618272E-2,0.23495849088098766,1,0]
[0.81812047765799634,0.44778628939699017,0.10392690988028662,1,0]
[0.64122108974084313,0.75183330090065947,8.3363407630113365E-2,1,1]
[0.19102560565476701,0.33901844002055481,0.12138023901441926,1,1]
[0.73118671708104022,0.93693355335336348,0.24435822820070546,1,1]
[0.29108556085581194,0.1769640695471536,0.14799745524646687,1,1]
[0.54147395525299202,0.51056655340295432,1.83174101514467E-3,1,1]
[0.72167851054630994,0.80850867340964372,0.14431896360700866,1,1]
[0.88714863966524149,3.9944334352663091E-2,0.36153528468886126,0,0]
[6.2224792348438807E-2,0.37672366940529878,0.20684418611926159,1,0]
[0.71368648593070838,0.4530344671552049,4.7867675544810355E-2,1,0]
[6.086431553540439E-2,0.56656148492827318,0.19727058064604561,1,0]
[0.30401956110622308,0.45597850788698235,4.0346224196853908E-2,1,1]
[6.9498800081344458E-2,0.33389020195266705,0.21292374813872797,1,0]
[0.28652155223189735,0.66184516901940416,7.1766906396398031E-2,1,0]
[0.10326262364799699,0.40067815784731886,0.167265374123273,1,0]
[0.55891670735116972,0.21082405897378964,8.7093903273497669E-2,1,0]
[0.81095171713858816,0.40209340642280944,0.10627667145732571,1,0]
[0.93294371881124838,0.63720076259805114,0.2062643129156001,1,0]
[0.1383086090191229,0.31650012931515792,0.16449286485103548,1,1]
[0.56429601525992445,0.92427202293916899,0.18414072702719919,1,0]
[5.8401802835269412E-2,2.6362167887944765E-2,0.4193417637469477,0,1]
[0.8005533323039794,0.12487555154184726,0.23105065739005956,1,0]
[0.15614722403261772,0.10011898121490193,0.27813956072508272,0,1]
[0.19209666994818819,0.7262785483535602,0.14600644210198943,1,0]
[0.66405806979360804,4.6763154287151942E-2,0.2323386885761364,1,0]
[0.7688702047188527,7.0754007307911593E-2,0.25654330922777419,0,0]
[0.23212058240769629,4.400848669828461E-2,0.27968764257278034,0,1]
[0.36500413629520778,0.31259782761329169,5.3343457432660377E-2,1,1]
[0.52174710145849124,0.77255414657210741,7.4758699235495718E-2,1,0]
[7.7755983477932888E-2,0.59055834904230464,0.18649082406995554,1,0]
[{"$f":"RAND()","v":0.18714317319418861},0.79800683520162496,{"$f":"(A834-0.5)^2+(B834-0.5)^2","v":0.18668746790588991},{"$f":"1*(C834<0.5^2)","v":1},{"$f":"1*(ABS(A834-B834)<0.25)","v":0}]
[0.11785672924330692,0.15093803561652352,0.26787773436387463,0,1]
[0.29737463740020476,0.63998145057475198,6.0651844073710229E-2,1,0]
[0.1294928782335234,0.83010300053117836,0.24624351823936586,1,0]
[0.13246920825687358,0.4667585629816855,0.13618387601437193,1,0]
[0.67404757978452912,0.17649991202859094,0.13494486694636143,1,0]
[0.64108817673032537,0.59098082836786903,2.8183384743591167E-2,1,1]
[0.315565508320935,0.19594958029716736,0.12646273944238379,1,1]
[0.55295107077392947,0.56251434879348539,6.711859701179235E-3,1,1]
[0.82980853664485121,0.87295863069165291,0.24787181105121092,1,1]
[0.56556067206298632,0.62030007454435165,1.8770309656726998E-2,1,1]
[0.79614005478688943,0.58713584302799826,9.5291587189381827E-2,1,1]
[7.9006156326548727E-2,0.38301338614249891,0.19092168423279038,1,0]
[0.40322902028444652,0.25024144638595081,7.1743957618489951E-2,1,1]
[0.41864492185490487,0.22580287279040578,8.1802713309988923E-2,1,1]
[0.71794367519613578,0.6976101390811178,8.6549212625657457E-2,1,1]
[0.97247667293025342,0.71153730312159058,0.26798223707519736,0,0]
[0.82210450248087974,0.66412487328146819,0.13068828454811304,1,1]
[0.62501062307099775,0.98288252250470509,0.2488031864211061,1,0]
[0.94314945300208408,0.42185587134466263,0.20248794253934824,1,0]
[6.4362114390347558E-2,0.58551247274722007,0.1970927503737927,1,0]
[0.16349457580978433,0.90208566381028243,0.27490878155119247,0,0]
[4.6043124685448356E-2,0.3189012862811782,0.23887358875596318,1,0]
[0.52762760911394579,0.77503447739175968,7.6407248539511349E-2,1,1]
[0.70852815530434743,0.93709104410074817,0.23453257238771621,1,1]
[0.28312050658304266,0.23641090162741007,0.11651592744567094,1,1]
[0.78004882829622935,0.36831644044025569,9.5767906088415677E-2,1,0]
[0.55343375091973301,8.9933903065915533E-2,0.17100936959210603,1,0]
[0.25310052673276917,0.47010813258648276,6.1852873637103324E-2,1,1]
[0.6843361168901434,0.3588070725996575,5.3915246738014996E-2,1,0]
[0.10190581481661676,0.39251381462534229,0.17003226032321711,1,0]
[0.41103726595470869,7.737256388980096E-2,0.18652831780189361,1,0]
[{"$f":"RAND()","v":0.41690944743495928},0.70538233258567073,4.908594246389486E-2,1,0]
[0.15845919336346914,0.24462106944863149,0.18186852076749285,1,1]
[0.71201779409589294,0.74368510968175128,0.1043339776938956,1,1]
[4.5279951258157758E-2,0.70132186464091595,0.24730081591027869,1,0]
[0.37935926643409745,0.92407283972848775,0.19439195999070275,1,0]
[0.28383050431295553,0.40354693836397348,5.6032443964554264E-2,1,1]
[0.91416968938580434,0.85069414420060863,0.29452291438253092,0,1]
[0.30307900267714938,0.92195629395830836,0.21682499319765647,1,0]
[0.45655832535061414,0.45930190096486045,3.5435143614171208E-3,1,1]
[0.33876165804212921,0.77990785817447006,0.10434621198514252,1,0]
[0.11259654576476008,0.45756502069145855,0.15188216382231198,1,0]
[0.34974173598270375,0.21439239497045459,0.10414924995620432,1,1]
[0.73457227068966002,0.63687803832451884,7.3759747552071583E-2,1,1]
[0.97540110863916829,0.65990135273246953,0.25157465670102391,0,0]
[0.3223053667813075,0.46385944093985576,3.2881522683905429E-2,1,1]
[0.43516653872025202,0.47837000383366723,4.6712344356681515E-3,1,1]
[0.82748993998300724,0.17020717269956454,0.21601296972888853,1,0]
[0.60997036281822092,0.81890078579354442,0.11379119187811124,1,1]
[0.59349445264852063,0.47580100123753999,9.3268042171520075E-3,1,1]
[0.61678615235567213,0.64503712670265478,3.4674773504204198E-2,1,1]
[0.43577454149971828,0.98611922308742961,0.24043680857469754,1,0]
[0.71594005407206174,0.9081725456798444,0.2132349339994096,1,1]
[0.27734786049619864,6.8344150513523716E-2,0.2359007476215117,1,1]
[0.14461480191163489,0.41479196438893373,0.13355904835300322,1,0]
[0.51867724909491675,5.0801127362277265E-2,0.20212846681275462,1,0]
[0.32602842549204336,6.8205140151050614E-2,0.21671290972875135,1,0]
[6.8143307780850093E-2,0.44062388850709078,0.19002572523048394,1,0]
[0.25918135271385889,0.31890575213836392,9.0788747489298521E-2,1,1]
[9.6535616821969761E-2,0.59000171513544752,0.17088381722055068,1,0]
[1.438774621867811E-2,0.11833919299391549,0.38148423262711062,0,1]
[0.24375390170984967,0.75848731604033159,0.13247775544265966,1,0]
[0.27616659610002847,0.38088358435078584,6.4290113178564146E-2,1,1]
[{"$f":"RAND()","v":0.77262825176027417},0.37561330200535292,{"$f":"(A898-0.5)^2+(B898-0.5)^2","v":8.9798214295874965E-2},{"$f":"1*(C898<0.5^2)","v":1},{"$f":"1*(ABS(A898-B898)<0.25)","v":0}]
[0.58164150550337057,0.89656322383230125,0.16392772591712476,1,0]
[4.1109037614507793E-2,0.59706762458811447,0.22000303910226235,1,0]
[0.9291157258029602,0.21103966380595318,0.26763838202477785,0,0]
[0.74181153911157516,5.1306135382783502E-2,0.25979900459264182,0,0]
[0.4253159538327852,0.77189914977004115,7.9506854397577945E-2,1,0]
[0.72496417570725846,0.55573423564412305,5.3715185374480889E-2,1,1]
[0.11045604432426548,0.57714936828182928,0.15769651842978397,1,0]
[0.70347564542618468,0.9045091014300265,0.2050299514213299,1,1]
[0.82778013694021335,0.46306194903345121,0.10880423778175237,1,0]
[0.23806773988932672,7.6914595770767202E-2,0.24760976815849872,1,1]
[0.1443711810697047,0.51001173874812744,0.12657209176651751,1,0]
[0.76699164782800555,0.3649925031583624,8.9511564213358527E-2,1,0]
[0.35136564590015296,0.38333599002429186,3.5702662442290846E-2,1,1]
[0.1874903090394574,0.46616549252666095,9.8807080840217262E-2,1,0]
[0.58238607349145188,0.8648309378253709,0.13988907829987857,1,0]
[0.62309309026056625,0.1482198851088169,0.13890115810274989,1,0]
[0.71811722062791861,4.1360857289382991E-2,0.25792498516077783,0,0]
[0.2157211648920172,3.6779416831828948E-2,0.29538776476101214,0,1]
[0.19277348747257328,0.88875171742005077,0.24551602779680409,1,0]
[0.29269113393767976,7.3752093513547834E-2,0.22466424373212832,1,1]
[0.529962004956397,0.4064856027651601,9.6426642312025905E-3,1,1]
[0.90712364479213325,0.2691123369413646,0.21905877510150903,1,0]
[0.44035814237220039,0.30346548277296614,4.2182967642957987E-2,1,1]
[0.86973119195105308,0.86313227288029015,0.26856620190875202,0,1]
[0.89635081297814001,0.88962405596092708,0.30890087193187621,0,1]
[0.45298701007352082,0.65819804173875884,2.7236841631805318E-2,1,1]
[0.81113249248036656,0.46249294072195879,9.8210207372731853E-2,1,0]
[0.81654072726911886,0.43975501861565658,0.10382748980206258,1,0]
[0.33675791467578697,0.93996057815293754,0.2202132887496647,1,0]
[0.63092107732127478,0.30499621411906874,5.5166804994859292E-2,1,0]
[0.53073403591004276,0.69214025309773008,3.7862457823779574E-2,1,1]
[{"$f":"RAND()","v":0.45598697802857824},0.26399443374740728,5.7635773405263789E-2,1,1]
[0.9990589278853037,3.988541686029734E-2,0.46076524311985112,0,0]
[0.77989189962849892,0.60856270462779027,9.0125336313750554E-2,1,1]
[0.37679276274976747,3.0549041765462026E-2,0.235564225498161,1,0]
[0.24890642253790141,0.52087282621413489,6.3483659516880384E-2,1,0]
[0.74333252198578648,7.2987565603818916E-2,0.2415503353849161,1,0]
[0.67894200615234412,0.499597441977641,3.2020403618786927E-2,1,1]
[0.64537026876082504,0.75034919088863206,8.3807232418187244E-2,1,1]
[0.37182690130276908,0.45187661177671035,1.8744203723739552E-2,1,1]
[0.97828978949667422,0.34987352548713879,0.25129908108643367,0,0]
[0.57621678795956921,0.88225882895759977,0.15193081108290946,1,0]
[8.1921059360161586E-2,2.4463003771662439E-2,0.40092543538839942,0,1]
[0.60001047450684242,0.94495625202489841,0.20798816122712871,1,0]
[0.44494227309739154,0.32105762669975846,3.5051726254005211E-2,1,1]
[0.43425461620042849,0.2439966433604378,6.9860174101675832E-2,1,1]
[0.22744137719457491,0.61197085214178093,8.6825674594946556E-2,1,0]
[0.50046687267236145,0.17115025990160582,0.10814236953287359,1,0]
[0.14742815078340554,0.8474753441857551,0.245046023677018,1,0]
[0.97834811473521188,0.83807843751330446,0.34311394878216872,0,1]
[0.69985145980736574,0.23017771014457844,0.11274467408995825,1,0]
[0.81426305090954854,0.21622130695673336,0.17929161179232203,1,0]
[0.49533627517080392,0.31112398933403185,3.5695897734373379E-2,1,1]
[0.81377805962721839,0.35860065693180287,0.11845044492353993,1,0]
[0.58366396946081767,0.64023757000705839,2.6666235827425232E-2,1,1]
[0.55181459924967025,0.66196938462329247,2.8918834250651979E-2,1,1]
[0.46579515262285609,0.11446022545899803,0.14981088933722034,1,0]
[0.77197688298813749,0.93986367611826949,0.26745147844822093,0,1]
[0.72636349725807514,0.89829794804222707,0.2098816883055552,1,1]
[0.21646887898849065,0.45716372961168728,8.2224842642823787E-2,1,1]
[0.10965614130413504,0.56947098772693761,0.15719454615733372,1,0]
[0.77015262056434441,0.35602980824034069,9.3709854513095728E-2,1,0]
[3.1787678667033803E-2,2.6178415217608997E-2,0.44372967205370134,0,1]
[{"$f":"RAND()","v":0.95260234818801981},0.75888981014607382,{"$f":"(A962-0.5)^2+(B962-0.5)^2","v":0.27187281938277968},{"$f":"1*(C962<0.5^2)","v":0},{"$f":"1*(ABS(A962-B962)<0.25)","v":1}]
[0.82298019894684327,0.40821952000018913,0.11273986542073813,1,0]
[0.51904812604291906,3.9583814933811245E-3,0.24642011839641292,1,0]
[5.8321892083513127E-2,0.27357532764778369,0.24634768326249631,1,1]
[0.8546853522299368,0.92554891531109296,0.30689357840892212,0,1]
[0.7773809689188399,0.29158127524478905,0.12037856674694281,1,0]
[9.7211095032469386E-2,0.62405448009945796,0.17762841599768919,1,0]
[0.28748395380322811,0.55503524874210297,4.8191948495213632E-2,1,0]
[2.8102768212878604E-2,0.52554026368181805,0.22333930243728498,1,0]
[9.6347574290574278E-2,0.92225374330202714,0.34123350451367768,0,0]
[0.54673614281527461,0.19895120385684051,9.2814644704495339E-2,1,0]
[0.34382741836373987,0.25550744936831871,8.4166482569319578E-2,1,1]
[6.1296513357152804E-2,0.88746685642107681,0.34259131401742215,0,0]
[0.58223689701668324,0.16718282128671835,0.11753018167760101,1,0]
[0.3145299008725424,9.8278287695754862E-2,0.19577949180700366,1,1]
[8.9002769138298965E-2,0.48625979882369608,0.16910751690435169,1,0]
[0.20710010901529874,0.66624265880156508,0.11342696774426346,1,0]
[0.32427495901709935,0.17108992059559958,0.1390611303622511,1,1]
[0.71711252643864076,0.10327885965376016,0.20452551233419042,1,0]
[0.38884359843655814,0.93366296777423918,0.20041931522729395,1,0]
[0.48925640612518895,0.9865555595844957,0.23685173737192861,1,0]
[0.62712711190403514,0.12375439296906943,0.15772205939113451,1,0]
[0.28078955818506834,0.87690018973153727,0.19010697082036634,1,0]
[0.4847739029466781,9.3145436272727422E-2,0.16576247005718647,1,0]
[0.52545846450608402,0.73362378327919142,5.5228205528690136E-2,1,1]
[0.84188692144578869,0.463277691573316,0.1182351949918634,1,0]
[0.27401603668770114,0.45121472458968725,5.3448754771194505E-2,1,1]
[0.86251467934548076,0.48461654665797205,0.13165354337768309,1,0]
[0.86540963642316049,0.99837736669823018,0.38190420202796854,0,1]
[0.10450762442399719,0.69556559339055402,0.19466012045694958,1,0]
[0.26840179319537227,0.43047793315963057,5.8471047172875906E-2,1,1]
[0.37799204806626008,7.789638776337493E-2,0.19305739979827294,1,0]
[0.84594672583390829,0.1170751961920441,0.26631054248656283,0,0]
[0.33540683910518521,0.36589324977936599,4.5075529068085915E-2,1,1]
[0.11874499314308418,0.75864548022793055,0.21225286469580373,1,0]
[0.5084981770925433,0.51429828765626806,2.766600437976153E-4,1,1]
[8.956272115762709E-2,6.1406938076340234E-2,0.36082263383110302,0,1]
[0.16080176395521661,0.86893703504296504,0.25116997916218659,0,0]
[0.63679054993383721,0.35088888865240708,4.0945778078515863E-2,1,0]

{"sheet":"code","index":5,"n_rows":45,"n_cols":23,"rows_kept":45,"cut":false,"hidden":false,"merged":[[0,22,1,22],[0,12,0,16],[0,6,0,10],[0,18,1,18],[0,19,1,19],[0,21,1,21]]}
["min",2,null,null,null,null,"assegnazione clienti 4 file",null,null,null,null,null,"assegnazione clienti fila unica",null,null,null,null,null,"tempi attesa 4 file","tempi attesa fila unica",null,"guadagno 4 file","guadagno fila unica"]
["max",8,null,null,null,null,null,1,2,3,4,null,null,1,2,3,4]
[]
[null,null,1,{"$f":"RAND()*($B$2-$B$1)+$B$1","v":3.6095688895339273},{"$f":"D4/1440","v":"00:03:36.574"},null,{"$f":"MOD(C4-1,4)+1","v":1},{"$f":"IF($G4=H$2,$E4,\"\")","v":"00:03:36.574"},"","","",null,{"$f":"G4","v":1},{"$f":"H4","v":"00:03:36.574"},{"$f":"I4","v":""},{"$f":"J4","v":""},{"$f":"K4","v":""},null,{"$f":"SUM(INDEX($H$3:$K3,0,$G4))","v":"00:00:00"},{"$f":"SUM(INDEX($N$3:$Q3,0,$M4))","v":"00:00:00"},null,{"$f":"IF(T4>S4,T4-S4,\"\")","v":""},{"$f":"IF(S4>T4,S4-T4,\"\")","v":""}]
[null,null,{"$f":"C4+1","v":2},4.0545970759148373,{"$f":"D5/1440","v":"00:04:03.276"},null,{"$f":"MOD(C5-1,4)+1","v":2},"","00:04:03.276","","",null,{"$f":"G5","v":2},"","00:04:03.276","","",null,{"$f":"SUM(INDEX($H$3:$K4,0,$G5))","v":"00:00:00"},{"$f":"SUM(INDEX($N$3:$Q4,0,$M5))","v":"00:00:00"},null,"",""]
[null,null,{"$f":"C5+1","v":3},2.7339590096598645,"00:02:44.038",null,3,"","","00:02:44.038","",null,3,"","","00:02:44.038","",null,{"$f":"SUM(INDEX($H$3:$K5,0,$G6))","v":"00:00:00"},{"$f":"SUM(INDEX($N$3:$Q5,0,$M6))","v":"00:00:00"},null,"",""]
[null,null,4,7.9692025368781625,"00:07:58.152",null,4,"","","","00:07:58.152",null,4,"","","","00:07:58.152",null,{"$f":"SUM(INDEX($H$3:$K6,0,$G7))","v":"00:00:00"},{"$f":"SUM(INDEX($N$3:$Q6,0,$M7))","v":"00:00:00"},null,"",""]
[null,null,5,7.9270421900586685,"00:07:55.623",null,1,"00:07:55.623","","","",null,{"$f":"1*(N8<>\"\")+2*(O8<>\"\")+3*(P8<>\"\")+4*(Q8<>\"\")","v":3},{"$f":"IF(SUM(N$4:N7)>MIN(SUM($N$4:$N7),SUM($O$4:$O7),SUM($P$4:$P7),SUM($Q$4:$Q7)),\"\",$E8)","v":""},{"$f":"IF(SUM(O$4:O7)>MIN(SUM($N$4:$N7),SUM($O$4:$O7),SUM($P$4:$P7),SUM($Q$4:$Q7)),\"\",$E8)","v":""},{"$f":"IF(SUM(P$4:P7)>MIN(SUM($N$4:$N7),SUM($O$4:$O7),SUM($P$4:$P7),SUM($Q$4:$Q7)),\"\",$E8)","v":"00:07:55.623"},{"$f":"IF(SUM(Q$4:Q7)>MIN(SUM($N$4:$N7),SUM($O$4:$O7),SUM($P$4:$P7),SUM($Q$4:$Q7)),\"\",$E8)","v":""},null,{"$f":"SUM(INDEX($H$3:$K7,0,$G8))","v":"00:03:36.574"},{"$f":"SUM(INDEX($N$3:$Q7,0,$M8))","v":"00:02:44.038"},null,"","00:00:52.537"]
[null,null,6,5.7535477023435595,"00:05:45.213",null,2,"","00:05:45.213","","",null,{"$f":"1*(N9<>\"\")+2*(O9<>\"\")+3*(P9<>\"\")+4*(Q9<>\"\")","v":1},{"$f":"IF(SUM(N$4:N8)>MIN(SUM($N$4:$N8),SUM($O$4:$O8),SUM($P$4:$P8),SUM($Q$4:$Q8)),\"\",$E9)","v":"00:05:45.213"},{"$f":"IF(SUM(O$4:O8)>MIN(SUM($N$4:$N8),SUM($O$4:$O8),SUM($P$4:$P8),SUM($Q$4:$Q8)),\"\",$E9)","v":""},{"$f":"IF(SUM(P$4:P8)>MIN(SUM($N$4:$N8),SUM($O$4:$O8),SUM($P$4:$P8),SUM($Q$4:$Q8)),\"\",$E9)","v":""},{"$f":"IF(SUM(Q$4:Q8)>MIN(SUM($N$4:$N8),SUM($O$4:$O8),SUM($P$4:$P8),SUM($Q$4:$Q8)),\"\",$E9)","v":""},null,{"$f":"SUM(INDEX($H$3:$K8,0,$G9))","v":"00:04:03.276"},{"$f":"SUM(INDEX($N$3:$Q8,0,$M9))","v":"00:03:36.574"},null,"","00:00:26.702"]
[null,null,7,3.6420396855532902,"00:03:38.522",null,3,"","","00:03:38.522","",null,2,{"$f":"IF(SUM(N$4:N9)>MIN(SUM($N$4:$N9),SUM($O$4:$O9),SUM($P$4:$P9),SUM($Q$4:$Q9)),\"\",$E10)","v":""},{"$f":"IF(SUM(O$4:O9)>MIN(SUM($N$4:$N9),SUM($O$4:$O9),SUM($P$4:$P9),SUM($Q$4:$Q9)),\"\",$E10)","v":"00:03:38.522"},{"$f":"IF(SUM(P$4:P9)>MIN(SUM($N$4:$N9),SUM($O$4:$O9),SUM($P$4:$P9),SUM($Q$4:$Q9)),\"\",$E10)","v":""},{"$f":"IF(SUM(Q$4:Q9)>MIN(SUM($N$4:$N9),SUM($O$4:$O9),SUM($P$4:$P9),SUM($Q$4:$Q9)),\"\",$E10)","v":""},null,{"$f":"SUM(INDEX($H$3:$K9,0,$G10))","v":"00:02:44.038"},{"$f":"SUM(INDEX($N$3:$Q9,0,$M10))","v":"00:04:03.276"},null,"00:01:19.238",""]
[null,null,8,7.4881516291604653,"00:07:29.289",null,4,"","","","00:07:29.289",null,2,{"$f":"IF(SUM(N$4:N10)>MIN(SUM($N$4:$N10),SUM($O$4:$O10),SUM($P$4:$P10),SUM($Q$4:$Q10)),\"\",$E11)","v":""},{"$f":"IF(SUM(O$4:O10)>MIN(SUM($N$4:$N10),SUM($O$4:$O10),SUM($P$4:$P10),SUM($Q$4:$Q10)),\"\",$E11)","v":"00:07:29.289"},{"$f":"IF(SUM(P$4:P10)>MIN(SUM($N$4:$N10),SUM($O$4:$O10),SUM($P$4:$P10),SUM($Q$4:$Q10)),\"\",$E11)","v":""},{"$f":"IF(SUM(Q$4:Q10)>MIN(SUM($N$4:$N10),SUM($O$4:$O10),SUM($P$4:$P10),SUM($Q$4:$Q10)),\"\",$E11)","v":""},null,{"$f":"SUM(INDEX($H$3:$K10,0,$G11))","v":"00:07:58.152"},{"$f":"SUM(INDEX($N$3:$Q10,0,$M11))","v":"00:07:41.798"},null,"","00:00:16.354"]
[null,null,9,5.066584288888925,"00:05:03.995",null,1,"00:05:03.995","","","",null,4,{"$f":"IF(SUM(N$4:N11)>MIN(SUM($N$4:$N11),SUM($O$4:$O11),SUM($P$4:$P11),SUM($Q$4:$Q11)),\"\",$E12)","v":""},{"$f":"IF(SUM(O$4:O11)>MIN(SUM($N$4:$N11),SUM($O$4:$O11),SUM($P$4:$P11),SUM($Q$4:$Q11)),\"\",$E12)","v":""},{"$f":"IF(SUM(P$4:P11)>MIN(SUM($N$4:$N11),SUM($O$4:$O11),SUM($P$4:$P11),SUM($Q$4:$Q11)),\"\",$E12)","v":""},{"$f":"IF(SUM(Q$4:Q11)>MIN(SUM($N$4:$N11),SUM($O$4:$O11),SUM($P$4:$P11),SUM($Q$4:$Q11)),\"\",$E12)","v":"00:05:03.995"},null,{"$f":"SUM(INDEX($H$3:$K11,0,$G12))","v":"00:11:32.197"},{"$f":"SUM(INDEX($N$3:$Q11,0,$M12))","v":"00:07:58.152"},null,"","00:03:34.045"]
[null,null,10,2.0359447708546128,"00:02:02.157",null,2,"","00:02:02.157","","",null,1,{"$f":"IF(SUM(N$4:N12)>MIN(SUM($N$4:$N12),SUM($O$4:$O12),SUM($P$4:$P12),SUM($Q$4:$Q12)),\"\",$E13)","v":"00:02:02.157"},{"$f":"IF(SUM(O$4:O12)>MIN(SUM($N$4:$N12),SUM($O$4:$O12),SUM($P$4:$P12),SUM($Q$4:$Q12)),\"\",$E13)","v":""},{"$f":"IF(SUM(P$4:P12)>MIN(SUM($N$4:$N12),SUM($O$4:$O12),SUM($P$4:$P12),SUM($Q$4:$Q12)),\"\",$E13)","v":""},{"$f":"IF(SUM(Q$4:Q12)>MIN(SUM($N$4:$N12),SUM($O$4:$O12),SUM($P$4:$P12),SUM($Q$4:$Q12)),\"\",$E13)","v":""},null,{"$f":"SUM(INDEX($H$3:$K12,0,$G13))","v":"00:09:48.489"},{"$f":"SUM(INDEX($N$3:$Q12,0,$M13))","v":"00:09:21.787"},null,"","00:00:26.702"]
[null,null,11,2.5462910541315109,"00:02:32.777",null,3,"","","00:02:32.777","",null,3,{"$f":"IF(SUM(N$4:N13)>MIN(SUM($N$4:$N13),SUM($O$4:$O13),SUM($P$4:$P13),SUM($Q$4:$Q13)),\"\",$E14)","v":""},{"$f":"IF(SUM(O$4:O13)>MIN(SUM($N$4:$N13),SUM($O$4:$O13),SUM($P$4:$P13),SUM($Q$4:$Q13)),\"\",$E14)","v":""},{"$f":"IF(SUM(P$4:P13)>MIN(SUM($N$4:$N13),SUM($O$4:$O13),SUM($P$4:$P13),SUM($Q$4:$Q13)),\"\",$E14)","v":"00:02:32.777"},{"$f":"IF(SUM(Q$4:Q13)>MIN(SUM($N$4:$N13),SUM($O$4:$O13),SUM($P$4:$P13),SUM($Q$4:$Q13)),\"\",$E14)","v":""},null,{"$f":"SUM(INDEX($H$3:$K13,0,$G14))","v":"00:06:22.560"},{"$f":"SUM(INDEX($N$3:$Q13,0,$M14))","v":"00:10:39.660"},null,"00:04:17.100",""]
[null,null,12,2.8269776804863458,"00:02:49.619",null,4,"","","","00:02:49.619",null,1,{"$f":"IF(SUM(N$4:N14)>MIN(SUM($N$4:$N14),SUM($O$4:$O14),SUM($P$4:$P14),SUM($Q$4:$Q14)),\"\",$E15)","v":"00:02:49.619"},{"$f":"IF(SUM(O$4:O14)>MIN(SUM($N$4:$N14),SUM($O$4:$O14),SUM($P$4:$P14),SUM($Q$4:$Q14)),\"\",$E15)","v":""},{"$f":"IF(SUM(P$4:P14)>MIN(SUM($N$4:$N14),SUM($O$4:$O14),SUM($P$4:$P14),SUM($Q$4:$Q14)),\"\",$E15)","v":""},{"$f":"IF(SUM(Q$4:Q14)>MIN(SUM($N$4:$N14),SUM($O$4:$O14),SUM($P$4:$P14),SUM($Q$4:$Q14)),\"\",$E15)","v":""},null,{"$f":"SUM(INDEX($H$3:$K14,0,$G15))","v":"00:15:27.441"},{"$f":"SUM(INDEX($N$3:$Q14,0,$M15))","v":"00:11:23.944"},null,"","00:04:03.498"]
[null,null,13,5.4626128892508437,"00:05:27.757",null,1,"00:05:27.757","","","",null,4,{"$f":"IF(SUM(N$4:N15)>MIN(SUM($N$4:$N15),SUM($O$4:$O15),SUM($P$4:$P15),SUM($Q$4:$Q15)),\"\",$E16)","v":""},{"$f":"IF(SUM(O$4:O15)>MIN(SUM($N$4:$N15),SUM($O$4:$O15),SUM($P$4:$P15),SUM($Q$4:$Q15)),\"\",$E16)","v":""},{"$f":"IF(SUM(P$4:P15)>MIN(SUM($N$4:$N15),SUM($O$4:$O15),SUM($P$4:$P15),SUM($Q$4:$Q15)),\"\",$E16)","v":""},{"$f":"IF(SUM(Q$4:Q15)>MIN(SUM($N$4:$N15),SUM($O$4:$O15),SUM($P$4:$P15),SUM($Q$4:$Q15)),\"\",$E16)","v":"00:05:27.757"},null,{"$f":"SUM(INDEX($H$3:$K15,0,$G16))","v":"00:16:36.192"},{"$f":"SUM(INDEX($N$3:$Q15,0,$M16))","v":"00:13:02.147"},null,"","00:03:34.045"]
[null,null,14,6.9752289677962178,"00:06:58.514",null,2,"","00:06:58.514","","",null,3,{"$f":"IF(SUM(N$4:N16)>MIN(SUM($N$4:$N16),SUM($O$4:$O16),SUM($P$4:$P16),SUM($Q$4:$Q16)),\"\",$E17)","v":""},{"$f":"IF(SUM(O$4:O16)>MIN(SUM($N$4:$N16),SUM($O$4:$O16),SUM($P$4:$P16),SUM($Q$4:$Q16)),\"\",$E17)","v":""},{"$f":"IF(SUM(P$4:P16)>MIN(SUM($N$4:$N16),SUM($O$4:$O16),SUM($P$4:$P16),SUM($Q$4:$Q16)),\"\",$E17)","v":"00:06:58.514"},{"$f":"IF(SUM(Q$4:Q16)>MIN(SUM($N$4:$N16),SUM($O$4:$O16),SUM($P$4:$P16),SUM($Q$4:$Q16)),\"\",$E17)","v":""},null,{"$f":"SUM(INDEX($H$3:$K16,0,$G17))","v":"00:11:50.645"},{"$f":"SUM(INDEX($N$3:$Q16,0,$M17))","v":"00:13:12.438"},null,"00:01:21.792",""]
[null,null,15,5.4677319285032766,"00:05:28.064",null,3,"","","00:05:28.064","",null,1,{"$f":"IF(SUM(N$4:N17)>MIN(SUM($N$4:$N17),SUM($O$4:$O17),SUM($P$4:$P17),SUM($Q$4:$Q17)),\"\",$E18)","v":"00:05:28.064"},{"$f":"IF(SUM(O$4:O17)>MIN(SUM($N$4:$N17),SUM($O$4:$O17),SUM($P$4:$P17),SUM($Q$4:$Q17)),\"\",$E18)","v":""},{"$f":"IF(SUM(P$4:P17)>MIN(SUM($N$4:$N17),SUM($O$4:$O17),SUM($P$4:$P17),SUM($Q$4:$Q17)),\"\",$E18)","v":""},{"$f":"IF(SUM(Q$4:Q17)>MIN(SUM($N$4:$N17),SUM($O$4:$O17),SUM($P$4:$P17),SUM($Q$4:$Q17)),\"\",$E18)","v":""},null,{"$f":"SUM(INDEX($H$3:$K17,0,$G18))","v":"00:08:55.337"},{"$f":"SUM(INDEX($N$3:$Q17,0,$M18))","v":"00:14:13.562"},null,"00:05:18.225",""]
[null,null,16,5.3736677235680714,"00:05:22.420",null,4,"","","","00:05:22.420",null,2,{"$f":"IF(SUM(N$4:N18)>MIN(SUM($N$4:$N18),SUM($O$4:$O18),SUM($P$4:$P18),SUM($Q$4:$Q18)),\"\",$E19)","v":""},{"$f":"IF(SUM(O$4:O18)>MIN(SUM($N$4:$N18),SUM($O$4:$O18),SUM($P$4:$P18),SUM($Q$4:$Q18)),\"\",$E19)","v":"00:05:22.420"},{"$f":"IF(SUM(P$4:P18)>MIN(SUM($N$4:$N18),SUM($O$4:$O18),SUM($P$4:$P18),SUM($Q$4:$Q18)),\"\",$E19)","v":""},{"$f":"IF(SUM(Q$4:Q18)>MIN(SUM($N$4:$N18),SUM($O$4:$O18),SUM($P$4:$P18),SUM($Q$4:$Q18)),\"\",$E19)","v":""},null,{"$f":"SUM(INDEX($H$3:$K18,0,$G19))","v":"00:18:17.060"},{"$f":"SUM(INDEX($N$3:$Q18,0,$M19))","v":"00:15:11.087"},null,"","00:03:05.973"]
[null,null,17,4.4975839904929398,"00:04:29.855",null,1,"00:04:29.855","","","",null,4,{"$f":"IF(SUM(N$4:N19)>MIN(SUM($N$4:$N19),SUM($O$4:$O19),SUM($P$4:$P19),SUM($Q$4:$Q19)),\"\",$E20)","v":""},{"$f":"IF(SUM(O$4:O19)>MIN(SUM($N$4:$N19),SUM($O$4:$O19),SUM($P$4:$P19),SUM($Q$4:$Q19)),\"\",$E20)","v":""},{"$f":"IF(SUM(P$4:P19)>MIN(SUM($N$4:$N19),SUM($O$4:$O19),SUM($P$4:$P19),SUM($Q$4:$Q19)),\"\",$E20)","v":""},{"$f":"IF(SUM(Q$4:Q19)>MIN(SUM($N$4:$N19),SUM($O$4:$O19),SUM($P$4:$P19),SUM($Q$4:$Q19)),\"\",$E20)","v":"00:04:29.855"},null,{"$f":"SUM(INDEX($H$3:$K19,0,$G20))","v":"00:22:03.948"},{"$f":"SUM(INDEX($N$3:$Q19,0,$M20))","v":"00:18:29.904"},null,"","00:03:34.045"]
[null,null,18,6.82945700507533,"00:06:49.767",null,2,"","00:06:49.767","","",null,1,{"$f":"IF(SUM(N$4:N20)>MIN(SUM($N$4:$N20),SUM($O$4:$O20),SUM($P$4:$P20),SUM($Q$4:$Q20)),\"\",$E21)","v":"00:06:49.767"},{"$f":"IF(SUM(O$4:O20)>MIN(SUM($N$4:$N20),SUM($O$4:$O20),SUM($P$4:$P20),SUM($Q$4:$Q20)),\"\",$E21)","v":""},{"$f":"IF(SUM(P$4:P20)>MIN(SUM($N$4:$N20),SUM($O$4:$O20),SUM($P$4:$P20),SUM($Q$4:$Q20)),\"\",$E21)","v":""},{"$f":"IF(SUM(Q$4:Q20)>MIN(SUM($N$4:$N20),SUM($O$4:$O20),SUM($P$4:$P20),SUM($Q$4:$Q20)),\"\",$E21)","v":""},null,{"$f":"SUM(INDEX($H$3:$K20,0,$G21))","v":"00:18:49.159"},{"$f":"SUM(INDEX($N$3:$Q20,0,$M21))","v":"00:19:41.626"},null,"00:00:52.467",""]
[null,null,19,4.4764441329664244,"00:04:28.587",null,3,"","","00:04:28.587","",null,3,{"$f":"IF(SUM(N$4:N21)>MIN(SUM($N$4:$N21),SUM($O$4:$O21),SUM($P$4:$P21),SUM($Q$4:$Q21)),\"\",$E22)","v":""},{"$f":"IF(SUM(O$4:O21)>MIN(SUM($N$4:$N21),SUM($O$4:$O21),SUM($P$4:$P21),SUM($Q$4:$Q21)),\"\",$E22)","v":""},{"$f":"IF(SUM(P$4:P21)>MIN(SUM($N$4:$N21),SUM($O$4:$O21),SUM($P$4:$P21),SUM($Q$4:$Q21)),\"\",$E22)","v":"00:04:28.587"},{"$f":"IF(SUM(Q$4:Q21)>MIN(SUM($N$4:$N21),SUM($O$4:$O21),SUM($P$4:$P21),SUM($Q$4:$Q21)),\"\",$E22)","v":""},null,{"$f":"SUM(INDEX($H$3:$K21,0,$G22))","v":"00:14:23.401"},{"$f":"SUM(INDEX($N$3:$Q21,0,$M22))","v":"00:20:10.951"},null,"00:05:47.550",""]
[null,null,20,2.2068354504978251,"00:02:12.410",null,4,"","","","00:02:12.410",null,2,{"$f":"IF(SUM(N$4:N22)>MIN(SUM($N$4:$N22),SUM($O$4:$O22),SUM($P$4:$P22),SUM($Q$4:$Q22)),\"\",$E23)","v":""},{"$f":"IF(SUM(O$4:O22)>MIN(SUM($N$4:$N22),SUM($O$4:$O22),SUM($P$4:$P22),SUM($Q$4:$Q22)),\"\",$E23)","v":"00:02:12.410"},{"$f":"IF(SUM(P$4:P22)>MIN(SUM($N$4:$N22),SUM($O$4:$O22),SUM($P$4:$P22),SUM($Q$4:$Q22)),\"\",$E23)","v":""},{"$f":"IF(SUM(Q$4:Q22)>MIN(SUM($N$4:$N22),SUM($O$4:$O22),SUM($P$4:$P22),SUM($Q$4:$Q22)),\"\",$E23)","v":""},null,{"$f":"SUM(INDEX($H$3:$K22,0,$G23))","v":"00:23:39.480"},{"$f":"SUM(INDEX($N$3:$Q22,0,$M23))","v":"00:20:33.507"},null,"","00:03:05.973"]
[null,null,21,4.6007805248615012,"00:04:36.047",null,1,{"$f":"IF($G24=H$2,$E24,\"\")","v":"00:04:36.047"},"","","",null,2,{"$f":"IF(SUM(N$4:N23)>MIN(SUM($N$4:$N23),SUM($O$4:$O23),SUM($P$4:$P23),SUM($Q$4:$Q23)),\"\",$E24)","v":""},{"$f":"IF(SUM(O$4:O23)>MIN(SUM($N$4:$N23),SUM($O$4:$O23),SUM($P$4:$P23),SUM($Q$4:$Q23)),\"\",$E24)","v":"00:04:36.047"},{"$f":"IF(SUM(P$4:P23)>MIN(SUM($N$4:$N23),SUM($O$4:$O23),SUM($P$4:$P23),SUM($Q$4:$Q23)),\"\",$E24)","v":""},{"$f":"IF(SUM(Q$4:Q23)>MIN(SUM($N$4:$N23),SUM($O$4:$O23),SUM($P$4:$P23),SUM($Q$4:$Q23)),\"\",$E24)","v":""},null,{"$f":"SUM(INDEX($H$3:$K23,0,$G24))","v":"00:26:33.804"},{"$f":"SUM(INDEX($N$3:$Q23,0,$M24))","v":"00:22:45.917"},null,"","00:03:47.886"]
[null,null,22,4.8823731809688802,"00:04:52.942",null,2,"","00:04:52.942","","",null,4,{"$f":"IF(SUM(N$4:N24)>MIN(SUM($N$4:$N24),SUM($O$4:$O24),SUM($P$4:$P24),SUM($Q$4:$Q24)),\"\",$E25)","v":""},{"$f":"IF(SUM(O$4:O24)>MIN(SUM($N$4:$N24),SUM($O$4:$O24),SUM($P$4:$P24),SUM($Q$4:$Q24)),\"\",$E25)","v":""},{"$f":"IF(SUM(P$4:P24)>MIN(SUM($N$4:$N24),SUM($O$4:$O24),SUM($P$4:$P24),SUM($Q$4:$Q24)),\"\",$E25)","v":""},{"$f":"IF(SUM(Q$4:Q24)>MIN(SUM($N$4:$N24),SUM($O$4:$O24),SUM($P$4:$P24),SUM($Q$4:$Q24)),\"\",$E25)","v":"00:04:52.942"},null,{"$f":"SUM(INDEX($H$3:$K24,0,$G25))","v":"00:25:38.927"},{"$f":"SUM(INDEX($N$3:$Q24,0,$M25))","v":"00:22:59.759"},null,"","00:02:39.168"]
[null,null,23,5.1182061028718238,"00:05:07.092",null,3,"","","00:05:07.092","",null,3,{"$f":"IF(SUM(N$4:N25)>MIN(SUM($N$4:$N25),SUM($O$4:$O25),SUM($P$4:$P25),SUM($Q$4:$Q25)),\"\",$E26)","v":""},{"$f":"IF(SUM(O$4:O25)>MIN(SUM($N$4:$N25),SUM($O$4:$O25),SUM($P$4:$P25),SUM($Q$4:$Q25)),\"\",$E26)","v":""},{"$f":"IF(SUM(P$4:P25)>MIN(SUM($N$4:$N25),SUM($O$4:$O25),SUM($P$4:$P25),SUM($Q$4:$Q25)),\"\",$E26)","v":"00:05:07.092"},{"$f":"IF(SUM(Q$4:Q25)>MIN(SUM($N$4:$N25),SUM($O$4:$O25),SUM($P$4:$P25),SUM($Q$4:$Q25)),\"\",$E26)","v":""},null,{"$f":"SUM(INDEX($H$3:$K25,0,$G26))","v":"00:18:51.988"},{"$f":"SUM(INDEX($N$3:$Q25,0,$M26))","v":"00:24:39.538"},null,"00:05:47.550",""]
[null,null,24,5.4274142685352214,"00:05:25.645",null,4,"","","","00:05:25.645",null,1,{"$f":"IF(SUM(N$4:N26)>MIN(SUM($N$4:$N26),SUM($O$4:$O26),SUM($P$4:$P26),SUM($Q$4:$Q26)),\"\",$E27)","v":"00:05:25.645"},{"$f":"IF(SUM(O$4:O26)>MIN(SUM($N$4:$N26),SUM($O$4:$O26),SUM($P$4:$P26),SUM($Q$4:$Q26)),\"\",$E27)","v":""},{"$f":"IF(SUM(P$4:P26)>MIN(SUM($N$4:$N26),SUM($O$4:$O26),SUM($P$4:$P26),SUM($Q$4:$Q26)),\"\",$E27)","v":""},{"$f":"IF(SUM(Q$4:Q26)>MIN(SUM($N$4:$N26),SUM($O$4:$O26),SUM($P$4:$P26),SUM($Q$4:$Q26)),\"\",$E27)","v":""},null,{"$f":"SUM(INDEX($H$3:$K26,0,$G27))","v":"00:25:51.890"},{"$f":"SUM(INDEX($N$3:$Q26,0,$M27))","v":"00:26:31.394"},null,"00:00:39.504",""]
[null,null,25,6.9199041510043493,"00:06:55.194",null,1,"00:06:55.194","","","",null,2,{"$f":"IF(SUM(N$4:N27)>MIN(SUM($N$4:$N27),SUM($O$4:$O27),SUM($P$4:$P27),SUM($Q$4:$Q27)),\"\",$E28)","v":""},{"$f":"IF(SUM(O$4:O27)>MIN(SUM($N$4:$N27),SUM($O$4:$O27),SUM($P$4:$P27),SUM($Q$4:$Q27)),\"\",$E28)","v":"00:06:55.194"},{"$f":"IF(SUM(P$4:P27)>MIN(SUM($N$4:$N27),SUM($O$4:$O27),SUM($P$4:$P27),SUM($Q$4:$Q27)),\"\",$E28)","v":""},{"$f":"IF(SUM(Q$4:Q27)>MIN(SUM($N$4:$N27),SUM($O$4:$O27),SUM($P$4:$P27),SUM($Q$4:$Q27)),\"\",$E28)","v":""},null,{"$f":"SUM(INDEX($H$3:$K27,0,$G28))","v":"00:31:09.850"},{"$f":"SUM(INDEX($N$3:$Q27,0,$M28))","v":"00:27:21.964"},null,"","00:03:47.886"]
[null,null,26,3.949202102369942,"00:03:56.952",null,2,"","00:03:56.952","","",null,4,{"$f":"IF(SUM(N$4:N28)>MIN(SUM($N$4:$N28),SUM($O$4:$O28),SUM($P$4:$P28),SUM($Q$4:$Q28)),\"\",$E29)","v":""},{"$f":"IF(SUM(O$4:O28)>MIN(SUM($N$4:$N28),SUM($O$4:$O28),SUM($P$4:$P28),SUM($Q$4:$Q28)),\"\",$E29)","v":""},{"$f":"IF(SUM(P$4:P28)>MIN(SUM($N$4:$N28),SUM($O$4:$O28),SUM($P$4:$P28),SUM($Q$4:$Q28)),\"\",$E29)","v":""},{"$f":"IF(SUM(Q$4:Q28)>MIN(SUM($N$4:$N28),SUM($O$4:$O28),SUM($P$4:$P28),SUM($Q$4:$Q28)),\"\",$E29)","v":"00:03:56.952"},null,{"$f":"SUM(INDEX($H$3:$K28,0,$G29))","v":"00:30:31.869"},{"$f":"SUM(INDEX($N$3:$Q28,0,$M29))","v":"00:27:52.701"},null,"","00:02:39.168"]
[null,null,27,2.0389791101709465,"00:02:02.339",null,3,"","","00:02:02.339","",null,3,{"$f":"IF(SUM(N$4:N29)>MIN(SUM($N$4:$N29),SUM($O$4:$O29),SUM($P$4:$P29),SUM($Q$4:$Q29)),\"\",$E30)","v":""},{"$f":"IF(SUM(O$4:O29)>MIN(SUM($N$4:$N29),SUM($O$4:$O29),SUM($P$4:$P29),SUM($Q$4:$Q29)),\"\",$E30)","v":""},{"$f":"IF(SUM(P$4:P29)>MIN(SUM($N$4:$N29),SUM($O$4:$O29),SUM($P$4:$P29),SUM($Q$4:$Q29)),\"\",$E30)","v":"00:02:02.339"},{"$f":"IF(SUM(Q$4:Q29)>MIN(SUM($N$4:$N29),SUM($O$4:$O29),SUM($P$4:$P29),SUM($Q$4:$Q29)),\"\",$E30)","v":""},null,{"$f":"SUM(INDEX($H$3:$K29,0,$G30))","v":"00:23:59.080"},{"$f":"SUM(INDEX($N$3:$Q29,0,$M30))","v":"00:29:46.630"},null,"00:05:47.550",""]
[null,null,28,4.3566030254052759,"00:04:21.396",null,4,"","","","00:04:21.396",null,3,{"$f":"IF(SUM(N$4:N30)>MIN(SUM($N$4:$N30),SUM($O$4:$O30),SUM($P$4:$P30),SUM($Q$4:$Q30)),\"\",$E31)","v":""},{"$f":"IF(SUM(O$4:O30)>MIN(SUM($N$4:$N30),SUM($O$4:$O30),SUM($P$4:$P30),SUM($Q$4:$Q30)),\"\",$E31)","v":""},{"$f":"IF(SUM(P$4:P30)>MIN(SUM($N$4:$N30),SUM($O$4:$O30),SUM($P$4:$P30),SUM($Q$4:$Q30)),\"\",$E31)","v":"00:04:21.396"},{"$f":"IF(SUM(Q$4:Q30)>MIN(SUM($N$4:$N30),SUM($O$4:$O30),SUM($P$4:$P30),SUM($Q$4:$Q30)),\"\",$E31)","v":""},null,{"$f":"SUM(INDEX($H$3:$K30,0,$G31))","v":"00:31:17.535"},{"$f":"SUM(INDEX($N$3:$Q30,0,$M31))","v":"00:31:48.969"},null,"00:00:31.434",""]
[null,null,29,6.0044836493458558,"00:06:00.269",null,1,"00:06:00.269","","","",null,4,{"$f":"IF(SUM(N$4:N31)>MIN(SUM($N$4:$N31),SUM($O$4:$O31),SUM($P$4:$P31),SUM($Q$4:$Q31)),\"\",$E32)","v":""},{"$f":"IF(SUM(O$4:O31)>MIN(SUM($N$4:$N31),SUM($O$4:$O31),SUM($P$4:$P31),SUM($Q$4:$Q31)),\"\",$E32)","v":""},{"$f":"IF(SUM(P$4:P31)>MIN(SUM($N$4:$N31),SUM($O$4:$O31),SUM($P$4:$P31),SUM($Q$4:$Q31)),\"\",$E32)","v":""},{"$f":"IF(SUM(Q$4:Q31)>MIN(SUM($N$4:$N31),SUM($O$4:$O31),SUM($P$4:$P31),SUM($Q$4:$Q31)),\"\",$E32)","v":"00:06:00.269"},null,{"$f":"SUM(INDEX($H$3:$K31,0,$G32))","v":"00:38:05.045"},{"$f":"SUM(INDEX($N$3:$Q31,0,$M32))","v":"00:31:49.654"},null,"","00:06:15.391"]
[null,null,30,3.9558762139899062,"00:03:57.353",null,2,"","00:03:57.353","","",null,1,{"$f":"IF(SUM(N$4:N32)>MIN(SUM($N$4:$N32),SUM($O$4:$O32),SUM($P$4:$P32),SUM($Q$4:$Q32)),\"\",$E33)","v":"00:03:57.353"},{"$f":"IF(SUM(O$4:O32)>MIN(SUM($N$4:$N32),SUM($O$4:$O32),SUM($P$4:$P32),SUM($Q$4:$Q32)),\"\",$E33)","v":""},{"$f":"IF(SUM(P$4:P32)>MIN(SUM($N$4:$N32),SUM($O$4:$O32),SUM($P$4:$P32),SUM($Q$4:$Q32)),\"\",$E33)","v":""},{"$f":"IF(SUM(Q$4:Q32)>MIN(SUM($N$4:$N32),SUM($O$4:$O32),SUM($P$4:$P32),SUM($Q$4:$Q32)),\"\",$E33)","v":""},null,{"$f":"SUM(INDEX($H$3:$K32,0,$G33))","v":"00:34:28.821"},{"$f":"SUM(INDEX($N$3:$Q32,0,$M33))","v":"00:31:57.039"},null,"","00:02:31.783"]
[null,null,31,3.0927622926523721,"00:03:05.566",null,3,"","","00:03:05.566","",null,2,{"$f":"IF(SUM(N$4:N33)>MIN(SUM($N$4:$N33),SUM($O$4:$O33),SUM($P$4:$P33),SUM($Q$4:$Q33)),\"\",$E34)","v":""},{"$f":"IF(SUM(O$4:O33)>MIN(SUM($N$4:$N33),SUM($O$4:$O33),SUM($P$4:$P33),SUM($Q$4:$Q33)),\"\",$E34)","v":"00:03:05.566"},{"$f":"IF(SUM(P$4:P33)>MIN(SUM($N$4:$N33),SUM($O$4:$O33),SUM($P$4:$P33),SUM($Q$4:$Q33)),\"\",$E34)","v":""},{"$f":"IF(SUM(Q$4:Q33)>MIN(SUM($N$4:$N33),SUM($O$4:$O33),SUM($P$4:$P33),SUM($Q$4:$Q33)),\"\",$E34)","v":""},null,{"$f":"SUM(INDEX($H$3:$K33,0,$G34))","v":"00:26:01.419"},{"$f":"SUM(INDEX($N$3:$Q33,0,$M34))","v":"00:34:17.159"},null,"00:08:15.740",""]
[null,null,32,2.8252589761779712,"00:02:49.516",null,4,"","","","00:02:49.516",null,1,{"$f":"IF(SUM(N$4:N34)>MIN(SUM($N$4:$N34),SUM($O$4:$O34),SUM($P$4:$P34),SUM($Q$4:$Q34)),\"\",$E35)","v":"00:02:49.516"},{"$f":"IF(SUM(O$4:O34)>MIN(SUM($N$4:$N34),SUM($O$4:$O34),SUM($P$4:$P34),SUM($Q$4:$Q34)),\"\",$E35)","v":""},{"$f":"IF(SUM(P$4:P34)>MIN(SUM($N$4:$N34),SUM($O$4:$O34),SUM($P$4:$P34),SUM($Q$4:$Q34)),\"\",$E35)","v":""},{"$f":"IF(SUM(Q$4:Q34)>MIN(SUM($N$4:$N34),SUM($O$4:$O34),SUM($P$4:$P34),SUM($Q$4:$Q34)),\"\",$E35)","v":""},null,{"$f":"SUM(INDEX($H$3:$K34,0,$G35))","v":"00:35:38.931"},{"$f":"SUM(INDEX($N$3:$Q34,0,$M35))","v":"00:35:54.391"},null,"00:00:15.460",""]
[null,null,33,2.6518559590691413,"00:02:39.111",null,1,"00:02:39.111","","","",null,3,{"$f":"IF(SUM(N$4:N35)>MIN(SUM($N$4:$N35),SUM($O$4:$O35),SUM($P$4:$P35),SUM($Q$4:$Q35)),\"\",$E36)","v":""},{"$f":"IF(SUM(O$4:O35)>MIN(SUM($N$4:$N35),SUM($O$4:$O35),SUM($P$4:$P35),SUM($Q$4:$Q35)),\"\",$E36)","v":""},{"$f":"IF(SUM(P$4:P35)>MIN(SUM($N$4:$N35),SUM($O$4:$O35),SUM($P$4:$P35),SUM($Q$4:$Q35)),\"\",$E36)","v":"00:02:39.111"},{"$f":"IF(SUM(Q$4:Q35)>MIN(SUM($N$4:$N35),SUM($O$4:$O35),SUM($P$4:$P35),SUM($Q$4:$Q35)),\"\",$E36)","v":""},null,{"$f":"SUM(INDEX($H$3:$K35,0,$G36))","v":"00:44:05.314"},{"$f":"SUM(INDEX($N$3:$Q35,0,$M36))","v":"00:36:10.365"},null,"","00:07:54.948"]
[null,null,34,4.186578609785184,"00:04:11.195",null,2,"","00:04:11.195","","",null,2,{"$f":"IF(SUM(N$4:N36)>MIN(SUM($N$4:$N36),SUM($O$4:$O36),SUM($P$4:$P36),SUM($Q$4:$Q36)),\"\",$E37)","v":""},{"$f":"IF(SUM(O$4:O36)>MIN(SUM($N$4:$N36),SUM($O$4:$O36),SUM($P$4:$P36),SUM($Q$4:$Q36)),\"\",$E37)","v":"00:04:11.195"},{"$f":"IF(SUM(P$4:P36)>MIN(SUM($N$4:$N36),SUM($O$4:$O36),SUM($P$4:$P36),SUM($Q$4:$Q36)),\"\",$E37)","v":""},{"$f":"IF(SUM(Q$4:Q36)>MIN(SUM($N$4:$N36),SUM($O$4:$O36),SUM($P$4:$P36),SUM($Q$4:$Q36)),\"\",$E37)","v":""},null,{"$f":"SUM(INDEX($H$3:$K36,0,$G37))","v":"00:38:26.174"},{"$f":"SUM(INDEX($N$3:$Q36,0,$M37))","v":"00:37:22.724"},null,"","00:01:03.449"]
[null,null,35,6.668027463794381,"00:06:40.082",null,3,"","","00:06:40.082","",null,4,{"$f":"IF(SUM(N$4:N37)>MIN(SUM($N$4:$N37),SUM($O$4:$O37),SUM($P$4:$P37),SUM($Q$4:$Q37)),\"\",$E38)","v":""},{"$f":"IF(SUM(O$4:O37)>MIN(SUM($N$4:$N37),SUM($O$4:$O37),SUM($P$4:$P37),SUM($Q$4:$Q37)),\"\",$E38)","v":""},{"$f":"IF(SUM(P$4:P37)>MIN(SUM($N$4:$N37),SUM($O$4:$O37),SUM($P$4:$P37),SUM($Q$4:$Q37)),\"\",$E38)","v":""},{"$f":"IF(SUM(Q$4:Q37)>MIN(SUM($N$4:$N37),SUM($O$4:$O37),SUM($P$4:$P37),SUM($Q$4:$Q37)),\"\",$E38)","v":"00:06:40.082"},null,{"$f":"SUM(INDEX($H$3:$K37,0,$G38))","v":"00:29:06.985"},{"$f":"SUM(INDEX($N$3:$Q37,0,$M38))","v":"00:37:49.923"},null,"00:08:42.938",""]
[null,null,36,5.0072694950289982,"00:05:00.436",null,4,"","","","00:05:00.436",null,1,{"$f":"IF(SUM(N$4:N38)>MIN(SUM($N$4:$N38),SUM($O$4:$O38),SUM($P$4:$P38),SUM($Q$4:$Q38)),\"\",$E39)","v":"00:05:00.436"},{"$f":"IF(SUM(O$4:O38)>MIN(SUM($N$4:$N38),SUM($O$4:$O38),SUM($P$4:$P38),SUM($Q$4:$Q38)),\"\",$E39)","v":""},{"$f":"IF(SUM(P$4:P38)>MIN(SUM($N$4:$N38),SUM($O$4:$O38),SUM($P$4:$P38),SUM($Q$4:$Q38)),\"\",$E39)","v":""},{"$f":"IF(SUM(Q$4:Q38)>MIN(SUM($N$4:$N38),SUM($O$4:$O38),SUM($P$4:$P38),SUM($Q$4:$Q38)),\"\",$E39)","v":""},null,{"$f":"SUM(INDEX($H$3:$K38,0,$G39))","v":"00:38:28.447"},{"$f":"SUM(INDEX($N$3:$Q38,0,$M39))","v":"00:38:43.907"},null,"00:00:15.460",""]
[null,null,37,6.6525696417278262,"00:06:39.154",null,1,"00:06:39.154","","","",null,3,{"$f":"IF(SUM(N$4:N39)>MIN(SUM($N$4:$N39),SUM($O$4:$O39),SUM($P$4:$P39),SUM($Q$4:$Q39)),\"\",$E40)","v":""},{"$f":"IF(SUM(O$4:O39)>MIN(SUM($N$4:$N39),SUM($O$4:$O39),SUM($P$4:$P39),SUM($Q$4:$Q39)),\"\",$E40)","v":""},{"$f":"IF(SUM(P$4:P39)>MIN(SUM($N$4:$N39),SUM($O$4:$O39),SUM($P$4:$P39),SUM($Q$4:$Q39)),\"\",$E40)","v":"00:06:39.154"},{"$f":"IF(SUM(Q$4:Q39)>MIN(SUM($N$4:$N39),SUM($O$4:$O39),SUM($P$4:$P39),SUM($Q$4:$Q39)),\"\",$E40)","v":""},null,{"$f":"SUM(INDEX($H$3:$K39,0,$G40))","v":"00:46:44.425"},{"$f":"SUM(INDEX($N$3:$Q39,0,$M40))","v":"00:38:49.477"},null,"","00:07:54.948"]
[null,null,38,3.9735595739831195,"00:03:58.414",null,2,"","00:03:58.414","","",null,2,{"$f":"IF(SUM(N$4:N40)>MIN(SUM($N$4:$N40),SUM($O$4:$O40),SUM($P$4:$P40),SUM($Q$4:$Q40)),\"\",$E41)","v":""},{"$f":"IF(SUM(O$4:O40)>MIN(SUM($N$4:$N40),SUM($O$4:$O40),SUM($P$4:$P40),SUM($Q$4:$Q40)),\"\",$E41)","v":"00:03:58.414"},{"$f":"IF(SUM(P$4:P40)>MIN(SUM($N$4:$N40),SUM($O$4:$O40),SUM($P$4:$P40),SUM($Q$4:$Q40)),\"\",$E41)","v":""},{"$f":"IF(SUM(Q$4:Q40)>MIN(SUM($N$4:$N40),SUM($O$4:$O40),SUM($P$4:$P40),SUM($Q$4:$Q40)),\"\",$E41)","v":""},null,{"$f":"SUM(INDEX($H$3:$K40,0,$G41))","v":"00:42:37.368"},{"$f":"SUM(INDEX($N$3:$Q40,0,$M41))","v":"00:41:33.919"},null,"","00:01:03.449"]
[null,null,39,4.9342955205185621,"00:04:56.058",null,3,"","","00:04:56.058","",null,1,{"$f":"IF(SUM(N$4:N41)>MIN(SUM($N$4:$N41),SUM($O$4:$O41),SUM($P$4:$P41),SUM($Q$4:$Q41)),\"\",$E42)","v":"00:04:56.058"},{"$f":"IF(SUM(O$4:O41)>MIN(SUM($N$4:$N41),SUM($O$4:$O41),SUM($P$4:$P41),SUM($Q$4:$Q41)),\"\",$E42)","v":""},{"$f":"IF(SUM(P$4:P41)>MIN(SUM($N$4:$N41),SUM($O$4:$O41),SUM($P$4:$P41),SUM($Q$4:$Q41)),\"\",$E42)","v":""},{"$f":"IF(SUM(Q$4:Q41)>MIN(SUM($N$4:$N41),SUM($O$4:$O41),SUM($P$4:$P41),SUM($Q$4:$Q41)),\"\",$E42)","v":""},null,{"$f":"SUM(INDEX($H$3:$K41,0,$G42))","v":"00:35:47.066"},{"$f":"SUM(INDEX($N$3:$Q41,0,$M42))","v":"00:43:44.343"},null,"00:07:57.276",""]
[null,null,40,2.337644531578869,"00:02:20.259",null,4,"","","","00:02:20.259",null,4,{"$f":"IF(SUM(N$4:N42)>MIN(SUM($N$4:$N42),SUM($O$4:$O42),SUM($P$4:$P42),SUM($Q$4:$Q42)),\"\",$E43)","v":""},{"$f":"IF(SUM(O$4:O42)>MIN(SUM($N$4:$N42),SUM($O$4:$O42),SUM($P$4:$P42),SUM($Q$4:$Q42)),\"\",$E43)","v":""},{"$f":"IF(SUM(P$4:P42)>MIN(SUM($N$4:$N42),SUM($O$4:$O42),SUM($P$4:$P42),SUM($Q$4:$Q42)),\"\",$E43)","v":""},{"$f":"IF(SUM(Q$4:Q42)>MIN(SUM($N$4:$N42),SUM($O$4:$O42),SUM($P$4:$P42),SUM($Q$4:$Q42)),\"\",$E43)","v":"00:02:20.259"},null,{"$f":"SUM(INDEX($H$3:$K42,0,$G43))","v":"00:43:28.883"},{"$f":"SUM(INDEX($N$3:$Q42,0,$M43))","v":"00:44:30.004"},null,"00:01:01.121",""]
[]
[null,null,null,null,null,null,null,null,null,null,null,null,null,null,null,null,null,null,null,null,"totali",{"$f":"SUM(V4:V43)","v":4.0398208461640175E-2},{"$f":"SUM(W4:W43)","v":4.3494749860752642E-2}]

{"sheet":"viaggio","index":6,"n_rows":894,"n_cols":19,"rows_kept":894,"cut":false,"hidden":false,"merged":[]}
[null,null,null,"attesa",null,"tram"]
[null,"percorso A",null,"15 e 15",null,15]
[]
[null,"percorso B",null,5,null,5,null,15]
[null,null,null,"piedi",null,"attesa max",null,"metro"]
[]
[0,0,null,12,null,null,null,null,null,null,0]
[20,20,null,6,null,null,null,null,null,null,5]
["attesa tram 1","attesa tram 2","attesa","tempo tram","tempo compl. A",null,null,null,null,"piedi","attesa","metro","tempo compl. B"]
[{"$f":"A$7+RAND()*A$8","v":10.964726492846255},1.0706543719705497,{"$f":"MIN(A10:B10)","v":1.0706543719705497},{"$f":"D$7+RAND()*D$8","v":16.142546691169965},{"$f":"D10+C10","v":17.213201063140517},null,{"$f":"AVERAGE(C10:C894)","v":6.6603062750562749},null,null,5,{"$f":"K$7+RAND()*K$8","v":1.2939398338249242},15,{"$f":"L10+K10+J10","v":21.293939833824926},null,1,{"$f":"(E10<M10)*1","v":1},{"$f":"SUM(P$10:P10)/O10","v":1},{"$f":"E10-M10","v":-4.0807387706844089},{"$f":"Q894","v":0.59209039548022602}]
[12.219010445650015,13.951163937914746,12.219010445650015,13.231436764860915,25.45044721051093,null,null,null,null,5,2.4118591472555542,15,22.411859147255555,null,{"$f":"O10+1","v":2},0,{"$f":"SUM(P$10:P11)/O11","v":0.5},3.038588063255375]
[6.9084699261570464,19.210059282703167,6.9084699261570464,15.706482035868531,22.614951962025579,null,null,null,null,5,3.971230666202648,15,23.971230666202647,null,3,1,{"$f":"SUM(P$10:P12)/O12","v":0.66666666666666663},-1.3562787041770683]
[16.938125759947017,9.7864865921122739,9.7864865921122739,16.334798896490366,26.121285488602638,null,null,null,null,5,0.22669099195711973,15,20.226690991957121,null,4,0,{"$f":"SUM(P$10:P13)/O13","v":0.5},5.8945944966455173]
[17.295313421900193,5.2758585333320358,5.2758585333320358,13.065224690779059,18.341083224111095,null,null,null,null,5,2.9642620821360346,15,22.964262082136035,null,5,1,{"$f":"SUM(P$10:P14)/O14","v":0.6},-4.6231788580249393]
[15.056134157221484,12.712737184364784,12.712737184364784,12.24122487822873,24.953962062593511,null,null,null,null,5,2.7866878346604111,15,22.786687834660412,null,6,0,{"$f":"SUM(P$10:P15)/O15","v":0.5},2.167274227933099]
[6.4357668003391133,1.9823842727080865,1.9823842727080865,15.913714281443522,17.896098554151607,null,null,null,null,5,4.1229976772631014,15,24.122997677263101,null,7,1,{"$f":"SUM(P$10:P16)/O16","v":0.5714285714285714},-6.2268991231114939]
[3.857796636512707,1.7327105040565449E-2,1.7327105040565449E-2,15.19230325434107,15.209630359381634,null,null,null,null,5,3.1137974774547161,15,23.113797477454717,null,8,1,{"$f":"SUM(P$10:P17)/O17","v":0.625},-7.904167118073083]
[7.5992991443260856,15.114918917109968,7.5992991443260856,15.278186694902796,22.877485839228882,null,null,null,null,5,0.82833836899245339,15,20.828338368992455,null,9,0,{"$f":"SUM(P$10:P18)/O18","v":0.55555555555555558},2.0491474702364272]
[10.34666121152021,6.1451155574545879,6.1451155574545879,14.078749297763746,20.223864855218334,null,null,null,null,5,3.2548510502855161,15,23.254851050285517,null,10,1,{"$f":"SUM(P$10:P19)/O19","v":0.6},-3.0309861950671824]
[7.3141836085288681E-2,8.6877600701052611,7.3141836085288681E-2,15.358779176413899,15.431921012499188,null,null,null,null,5,1.1222284696122131,15,21.122228469612214,null,11,1,{"$f":"SUM(P$10:P20)/O20","v":0.63636363636363635},-5.6903074571130254]
[8.0653721214933327,3.2444005009473131,3.2444005009473131,14.80977126111156,18.054171762058875,null,null,null,null,5,3.5949106136233064,15,23.594910613623306,null,12,1,{"$f":"SUM(P$10:P21)/O21","v":0.66666666666666663},-5.5407388515644307]
[10.742052834276983,11.331385727285426,10.742052834276983,14.267705990644966,25.009758824921949,null,null,null,null,5,4.5140692440118357,15,24.514069244011836,null,13,0,{"$f":"SUM(P$10:P22)/O22","v":0.61538461538461542},0.49568958091011339]
[10.231161627908792,4.5926102713806216,4.5926102713806216,13.632204361279953,18.224814632660575,null,null,null,null,5,4.1733890305829426,15,24.173389030582943,null,14,1,{"$f":"SUM(P$10:P23)/O23","v":0.6428571428571429},-5.9485743979223678]
[14.819539528134349,8.5429880334290402,8.5429880334290402,14.605392393857239,23.148380427286277,null,null,null,null,5,4.5965003623852443,15,24.596500362385243,null,15,1,{"$f":"SUM(P$10:P24)/O24","v":0.66666666666666663},-1.4481199350989655]
[2.01138517593761,18.761091284563086,2.01138517593761,16.795738501959192,18.807123677896804,null,null,null,null,5,4.1911414034690573,15,24.191141403469057,null,16,1,{"$f":"SUM(P$10:P25)/O25","v":0.6875},-5.384017725572253]
[4.5987935756898812,4.8166198363777379,4.5987935756898812,17.979794638072807,22.578588213762689,null,null,null,null,5,0.3640087517003443,15,20.364008751700347,null,17,0,{"$f":"SUM(P$10:P26)/O26","v":0.6470588235294118},2.2145794620623427]
[8.9029045441306813,19.210746013920851,8.9029045441306813,16.562754551299911,25.465659095430592,null,null,null,null,5,7.2535563861653163E-2,15,20.072535563861653,null,18,0,{"$f":"SUM(P$10:P27)/O27","v":0.61111111111111116},5.3931235315689392]
[14.339781517349541,16.558377149904583,14.339781517349541,13.607702045160806,27.947483562510349,null,null,null,null,5,3.8643437510861256,15,23.864343751086125,null,19,0,{"$f":"SUM(P$10:P28)/O28","v":0.57894736842105265},4.0831398114242248]
[16.005717445108768,4.0216048502012232,4.0216048502012232,15.585215593496427,19.60682044369765,null,null,null,null,5,2.8619269768822697,15,22.86192697688227,null,20,1,{"$f":"SUM(P$10:P29)/O29","v":0.6},-3.2551065331846196]
[{"$f":"A$7+RAND()*A$8","v":15.426248715740236},17.434582752350678,15.426248715740236,16.509736004335604,31.93598472007584,null,null,null,null,5,2.579666416958573,15,22.579666416958574,null,21,0,{"$f":"SUM(P$10:P30)/O30","v":0.5714285714285714},9.3563183031172663]
[14.53187871800548,1.2043928079387234,1.2043928079387234,14.906218701631472,16.110611509570194,null,null,null,null,5,0.11150313498436037,15,20.11150313498436,null,22,1,{"$f":"SUM(P$10:P31)/O31","v":0.59090909090909094},-4.000891625414166]
[11.588177840162695,12.366879942710167,11.588177840162695,13.27770837167672,24.865886211839417,null,null,null,null,5,4.3489214419121831,15,24.348921441912182,null,23,0,{"$f":"SUM(P$10:P32)/O32","v":0.56521739130434778},0.51696476992723461]
[10.486210425462838,1.3925873417718093,1.3925873417718093,16.159296293494958,17.551883635266766,null,null,null,null,5,0.39242052143276529,15,20.392420521432765,null,24,1,{"$f":"SUM(P$10:P33)/O33","v":0.58333333333333337},-2.8405368861659994]
[16.458921461540665,10.159364830861241,10.159364830861241,12.016105357260493,22.175470188121736,null,null,null,null,5,4.3376287789542167E-2,15,20.043376287789542,null,25,0,{"$f":"SUM(P$10:P34)/O34","v":0.56000000000000005},2.1320939003321939]
[15.173304549039786,9.4825787341051786,9.4825787341051786,14.083725685373656,23.566304419478833,null,null,null,null,5,2.301812268194523,15,22.301812268194524,null,26,0,{"$f":"SUM(P$10:P35)/O35","v":0.53846153846153844},1.2644921512843084]
[0.74920519724579249,0.24813986438434465,0.24813986438434465,17.647689571926296,17.895829436310642,null,null,null,null,5,2.5179493610591668,15,22.517949361059166,null,27,1,{"$f":"SUM(P$10:P36)/O36","v":0.55555555555555558},-4.6221199247485245]
[14.028445176218398,2.8785248248591011,2.8785248248591011,14.285558980079514,17.164083804938617,null,null,null,null,5,3.0301625843278539,15,23.030162584327854,null,28,1,{"$f":"SUM(P$10:P37)/O37","v":0.5714285714285714},-5.8660787793892375]
[7.5259916218390766,2.871680726960415,2.871680726960415,14.639270474845981,17.510951201806396,null,null,null,null,5,0.71598808861520868,15,20.715988088615209,null,29,1,{"$f":"SUM(P$10:P38)/O38","v":0.58620689655172409},-3.2050368868088128]
[9.3615141874880479,13.107545140309396,9.3615141874880479,12.320267062196114,21.681781249684164,null,null,null,null,5,4.3249494337247256,15,24.324949433724726,null,30,1,{"$f":"SUM(P$10:P39)/O39","v":0.6},-2.6431681840405616]
[3.9330061856300902,15.884958062699827,3.9330061856300902,16.011029099289889,19.94403528491998,null,null,null,null,5,0.74044582698877315,15,20.740445826988775,null,31,1,{"$f":"SUM(P$10:P40)/O40","v":0.61290322580645162},-0.79641054206879502]
[15.775344495578626,2.2632876518295131,2.2632876518295131,12.716353858927032,14.979641510756545,null,null,null,null,5,3.0948480096793101,15,23.094848009679311,null,32,1,{"$f":"SUM(P$10:P41)/O41","v":0.625},-8.115206498922765]
[7.9942302869992465,15.650915556834864,7.9942302869992465,17.223046509675005,25.217276796674252,null,null,null,null,5,3.5265176664082372,15,23.526517666408239,null,33,0,{"$f":"SUM(P$10:P42)/O42","v":0.60606060606060608},1.690759130266013]
[6.2295824579539261,3.4548479539888977,3.4548479539888977,16.46238904152219,19.91723699551109,null,null,null,null,5,2.8154982811581304,15,22.815498281158131,null,34,1,{"$f":"SUM(P$10:P43)/O43","v":0.61764705882352944},-2.8982612856470418]
[3.4147570669039107,7.2126966901063794,3.4147570669039107,14.953157929885217,18.367914996789128,null,null,null,null,5,3.9362703038297382,15,23.936270303829737,null,35,1,{"$f":"SUM(P$10:P44)/O44","v":0.62857142857142856},-5.5683553070406084]
[16.247661638952444,14.975988676974389,14.975988676974389,16.08833505792278,31.064323734897169,null,null,null,null,5,0.82571655310340442,15,20.825716553103405,null,36,0,{"$f":"SUM(P$10:P45)/O45","v":0.61111111111111116},10.238607181793764]
[7.7224445469574743,2.9005087054055689,2.9005087054055689,14.606989510094721,17.507498215500291,null,null,null,null,5,4.055943022355649,15,24.055943022355649,null,37,1,{"$f":"SUM(P$10:P46)/O46","v":0.6216216216216216},-6.5484448068553576]
[2.3864233234448728,12.767364810608214,2.3864233234448728,12.711689660977937,15.09811298442281,null,null,null,null,5,2.9034689681647552,15,22.903468968164756,null,38,1,{"$f":"SUM(P$10:P47)/O47","v":0.63157894736842102},-7.8053559837419453]
[17.285643218726115,16.616611345809922,16.616611345809922,13.05621769481515,29.672829040625071,null,null,null,null,5,4.5626364710360736,15,24.562636471036072,null,39,0,{"$f":"SUM(P$10:P48)/O48","v":0.61538461538461542},5.1101925695889996]
[18.757789303942612,3.4874205421094895,3.4874205421094895,13.54320281897256,17.03062336108205,null,null,null,null,5,2.5600689509663188,15,22.560068950966318,null,40,1,{"$f":"SUM(P$10:P49)/O49","v":0.625},-5.5294455898842685]
[{"$f":"A$7+RAND()*A$8","v":4.1749977975070411},11.565339537878661,4.1749977975070411,12.093466892308935,16.268464689815978,null,null,null,null,5,1.9704403040154417,15,21.97044030401544,null,41,1,{"$f":"SUM(P$10:P50)/O50","v":0.63414634146341464},-5.701975614199462]
[8.7035869040268281,18.339348805007603,8.7035869040268281,17.923429705584855,26.627016609611683,null,null,null,null,5,4.9689298342406696,15,24.968929834240669,null,42,0,{"$f":"SUM(P$10:P51)/O51","v":0.61904761904761907},1.6580867753710145]
[8.5310282313086905E-2,3.3134516411663517,8.5310282313086905E-2,12.490114607478652,12.575424889791739,null,null,null,null,5,3.6041900136808529,15,23.604190013680853,null,43,1,{"$f":"SUM(P$10:P52)/O52","v":0.62790697674418605},-11.028765123889114]
[2.403834334876378,3.7105156309954701,2.403834334876378,15.929114661324505,18.332948996200884,null,null,null,null,5,1.7981240143680814,15,21.798124014368081,null,44,1,{"$f":"SUM(P$10:P53)/O53","v":0.63636363636363635},-3.4651750181671979]
[17.09737839529144,18.3683088810565,17.09737839529144,14.45731091005881,31.554689305350252,null,null,null,null,5,3.0621713410088698,15,23.06217134100887,null,45,0,{"$f":"SUM(P$10:P54)/O54","v":0.62222222222222223},8.4925179643413813]
[0.95545683657630498,2.5773521840025992,0.95545683657630498,14.019057006633806,14.974513843210111,null,null,null,null,5,1.3786371471846526,15,21.378637147184651,null,46,1,{"$f":"SUM(P$10:P55)/O55","v":0.63043478260869568},-6.40412330397454]
[2.0207326024858308,5.7209964777287015,2.0207326024858308,14.150975444614811,16.171708047100644,null,null,null,null,5,3.0049259706683569,15,23.004925970668356,null,47,1,{"$f":"SUM(P$10:P56)/O56","v":0.63829787234042556},-6.8332179235677124]
[14.991179123178203,16.037924077246906,14.991179123178203,16.400340173029306,31.391519296207509,null,null,null,null,5,4.1831836021665243,15,24.183183602166523,null,48,0,{"$f":"SUM(P$10:P57)/O57","v":0.625},7.2083356940409864]
[18.759798361565995,4.9117156500817298,4.9117156500817298,12.543922406040002,17.455638056121732,null,null,null,null,5,2.1871142520931457,15,22.187114252093146,null,49,1,{"$f":"SUM(P$10:P58)/O58","v":0.63265306122448983},-4.731476195971414]
[7.8574961212797483,2.84843388240821,2.84843388240821,13.773878689809891,16.6223125722181,null,null,null,null,5,3.3087113352909774,15,23.308711335290976,null,50,1,{"$f":"SUM(P$10:P59)/O59","v":0.64},-6.6863987630728765]
[5.7278652557056926,18.8833817513827,5.7278652557056926,17.884173185534621,23.612038441240315,null,null,null,null,5,0.87698664973772877,15,20.876986649737731,null,51,0,{"$f":"SUM(P$10:P60)/O60","v":0.62745098039215685},2.7350517915025847]
[18.10200264676369,15.507419051222946,15.507419051222946,13.581662370384519,29.089081421607467,null,null,null,null,5,3.677984957924795,15,23.677984957924796,null,52,0,{"$f":"SUM(P$10:P61)/O61","v":0.61538461538461542},5.4110964636826715]
[13.59046972910342,13.602446960148027,13.59046972910342,16.119539109777627,29.710008838881045,null,null,null,null,5,2.9643655289008852,15,22.964365528900885,null,53,0,{"$f":"SUM(P$10:P62)/O62","v":0.60377358490566035},6.74564330998016]
[3.3194677030384701,2.0895503851300212,2.0895503851300212,12.485355571488514,14.574905956618535,null,null,null,null,5,3.6388248893489266,15,23.638824889348925,null,54,1,{"$f":"SUM(P$10:P63)/O63","v":0.61111111111111116},-9.06391893273039]
[4.6536266083390787,6.7277176375876735,4.6536266083390787,12.358440566956325,17.012067175295403,null,null,null,null,5,1.5666473450181639,15,21.566647345018165,null,55,1,{"$f":"SUM(P$10:P64)/O64","v":0.61818181818181817},-4.5545801697227617]
[0.29210407290449325,11.817474799010519,0.29210407290449325,16.811210658479197,17.103314731383691,null,null,null,null,5,0.37952935797438858,15,20.379529357974388,null,56,1,{"$f":"SUM(P$10:P65)/O65","v":0.625},-3.2762146265906971]
[5.4813700506417806,6.7104488364687853,5.4813700506417806,16.969924607137056,22.451294657778838,null,null,null,null,5,9.6609785764948386E-2,15,20.096609785764947,null,57,0,{"$f":"SUM(P$10:P66)/O66","v":0.61403508771929827},2.3546848720138911]
[19.417020332207237,1.6032609948386534,1.6032609948386534,12.626449636318593,14.229710631157246,null,null,null,null,5,1.0912047852089963,15,21.091204785208998,null,58,1,{"$f":"SUM(P$10:P67)/O67","v":0.62068965517241381},-6.8614941540517513]
[9.8499415000029416,8.9999602978469859,8.9999602978469859,16.260306091511424,25.26026638935841,null,null,null,null,5,1.6474399977225396,15,21.64743999772254,null,59,0,{"$f":"SUM(P$10:P68)/O68","v":0.61016949152542377},3.6128263916358705]
[10.981232174286564,10.919320208203931,10.919320208203931,16.564647331464375,27.483967539668306,null,null,null,null,5,4.5522844510071989,15,24.5522844510072,null,60,0,{"$f":"SUM(P$10:P69)/O69","v":0.6},2.9316830886611065]
[{"$f":"A$7+RAND()*A$8","v":10.578243562116615},9.0122615857338104,9.0122615857338104,16.104453022712796,25.116714608446607,null,null,null,null,5,2.7953823716285502,15,22.795382371628548,null,61,0,{"$f":"SUM(P$10:P70)/O70","v":0.5901639344262295},2.3213322368180584]
[15.842448293014275,6.8557554324809189,6.8557554324809189,17.632097014517029,24.487852446997948,null,null,null,null,5,3.7866661114425151,15,23.786666111442514,null,62,0,{"$f":"SUM(P$10:P71)/O71","v":0.58064516129032262},0.70118633555543397]
[4.2687786506703844,11.340416941853803,4.2687786506703844,15.080303075103583,19.349081725773967,null,null,null,null,5,2.9665015749720931,15,22.966501574972092,null,63,1,{"$f":"SUM(P$10:P72)/O72","v":0.58730158730158732},-3.6174198491981251]
[7.1279484133570659E-2,15.64477294725542,7.1279484133570659E-2,17.931378688619244,18.002658172752813,null,null,null,null,5,4.793319021161099,15,24.7933190211611,null,64,1,{"$f":"SUM(P$10:P73)/O73","v":0.59375},-6.7906608484082867]
[14.247416609819865,12.185580094125303,{"$f":"MIN(A74:B74)","v":12.185580094125303},{"$f":"D$7+RAND()*D$8","v":16.897210055506342},{"$f":"D74+C74","v":29.082790149631645},null,null,null,null,5,{"$f":"K$7+RAND()*K$8","v":2.6378628639080022},15,{"$f":"L74+K74+J74","v":22.637862863908001},null,65,{"$f":"(E74<M74)*1","v":0},{"$f":"SUM(P$10:P74)/O74","v":0.58461538461538465},{"$f":"E74-M74","v":6.4449272857236437}]
[3.0427196427033065,6.2356479880269884,3.0427196427033065,16.817424284825709,19.860143927529016,null,null,null,null,5,0.23836410921754148,15,20.238364109217542,null,{"$f":"O74+1","v":66},1,{"$f":"SUM(P$10:P75)/O75","v":0.59090909090909094},-0.37822018168852622]
[2.137576260246139,8.5190369274313973,2.137576260246139,17.422782488605748,19.560358748851886,null,null,null,null,5,1.330385413055974,15,21.330385413055975,null,67,1,{"$f":"SUM(P$10:P76)/O76","v":0.59701492537313428},-1.7700266642040887]
[0.38687712776761085,17.494798318323486,0.38687712776761085,16.08999073956727,16.476867867334882,null,null,null,null,5,2.3087367730813395,15,22.308736773081339,null,68,1,{"$f":"SUM(P$10:P77)/O77","v":0.6029411764705882},-5.8318689057464574]
[8.6407172020993279,13.830235572393811,8.6407172020993279,13.299316336377252,21.94003353847658,null,null,null,null,5,4.8967001724875958,15,24.896700172487595,null,69,1,{"$f":"SUM(P$10:P78)/O78","v":0.60869565217391308},-2.9566666340110146]
[11.059814136230834,8.1517791605149981,8.1517791605149981,15.980932486493389,24.132711647008385,null,null,null,null,5,1.4441080583342218,15,21.444108058334223,null,70,0,{"$f":"SUM(P$10:P79)/O79","v":0.6},2.6886035886741624]
[19.317098603133065,6.404912110742158,6.404912110742158,15.818970558204786,22.223882668946942,null,null,null,null,5,2.752147140578816,15,22.752147140578817,null,71,1,{"$f":"SUM(P$10:P80)/O80","v":0.60563380281690138},-0.52826447163187495]
[8.095363951604341,2.7183487439336784,2.7183487439336784,13.341013525260809,16.059362269194487,null,null,null,null,5,2.3625807499312184,15,22.362580749931219,null,72,1,{"$f":"SUM(P$10:P81)/O81","v":0.61111111111111116},-6.3032184807367315]
[4.0631633387034931,9.4394611682486218,4.0631633387034931,14.245540523393862,18.308703862097353,null,null,null,null,5,4.4617285265825632,15,24.461728526582561,null,73,1,{"$f":"SUM(P$10:P82)/O82","v":0.61643835616438358},-6.1530246644852085]
[12.857602487352702,1.1123312219146775,1.1123312219146775,16.745477328191029,17.857808550105705,null,null,null,null,5,3.5759095846391791,15,23.575909584639177,null,74,1,{"$f":"SUM(P$10:P83)/O83","v":0.6216216216216216},-5.718101034533472]
[11.272834288672065,18.318500142430562,11.272834288672065,13.251054279496227,24.523888568168292,null,null,null,null,5,1.9424712595926801,15,21.942471259592679,null,75,0,{"$f":"SUM(P$10:P84)/O84","v":0.61333333333333329},2.5814173085756131]
[17.936401609068295,15.134482905792687,15.134482905792687,13.55186420060854,28.686347106401229,null,null,null,null,5,0.26442822797719034,15,20.264428227977191,null,76,0,{"$f":"SUM(P$10:P85)/O85","v":0.60526315789473684},8.4219188784240373]
[9.7551479354794104,15.440194352999372,9.7551479354794104,12.310659298766222,22.065807234245632,null,null,null,null,5,4.8859364684489028,15,24.885936468448904,null,77,1,{"$f":"SUM(P$10:P86)/O86","v":0.61038961038961037},-2.8201292342032716]
[17.386887589043042,0.52027577890686016,0.52027577890686016,13.139637082636614,13.659912861543475,null,null,null,null,5,3.4523051591779552,15,23.452305159177953,null,78,1,{"$f":"SUM(P$10:P87)/O87","v":0.61538461538461542},-9.7923922976344784]
[5.5095761957254936,7.0589245285471014,5.5095761957254936,13.072396938555194,18.581973134280688,null,null,null,null,5,4.1910850484637656,15,24.191085048463766,null,79,1,{"$f":"SUM(P$10:P88)/O88","v":0.620253164556962},-5.6091119141830781]
[13.57291437454661,0.24133492993001049,0.24133492993001049,14.507360780922191,14.748695710852202,null,null,null,null,5,3.23075991218266,15,23.230759912182659,null,80,1,{"$f":"SUM(P$10:P89)/O89","v":0.625},-8.4820642013304575]
[{"$f":"A$7+RAND()*A$8","v":13.714652723708557},6.4722570575807055,6.4722570575807055,15.134465365466802,21.606722423047508,null,null,null,null,5,4.8474847534597822,15,24.847484753459781,null,81,1,{"$f":"SUM(P$10:P90)/O90","v":0.62962962962962965},-3.2407623304122737]
[7.4549911312430854,11.735926648237365,7.4549911312430854,17.00135582390001,24.456346955143097,null,null,null,null,5,1.8877563917682894,15,21.887756391768288,null,82,0,{"$f":"SUM(P$10:P91)/O91","v":0.62195121951219512},2.5685905633748085]
[7.2305594586418849,3.4153773124026032,3.4153773124026032,15.365512203731413,18.780889516134017,null,null,null,null,5,3.4747625250630607,15,23.47476252506306,null,83,1,{"$f":"SUM(P$10:P92)/O92","v":0.62650602409638556},-4.6938730089290424]
[1.0540496783379893,17.273413481431728,1.0540496783379893,15.534214429506342,16.588264107844331,null,null,null,null,5,1.9179376479007497,15,21.91793764790075,null,84,1,{"$f":"SUM(P$10:P93)/O93","v":0.63095238095238093},-5.3296735400564188]
[14.201087249045173,10.21424851627518,10.21424851627518,14.06681975399443,24.281068270269611,null,null,null,null,5,1.6572631085436806,15,21.657263108543681,null,85,0,{"$f":"SUM(P$10:P94)/O94","v":0.62352941176470589},2.6238051617259295]
[13.563529580066483,12.554184166225033,12.554184166225033,12.26365967838635,24.817843844611382,null,null,null,null,5,2.6271493745153922,15,22.62714937451539,null,86,0,{"$f":"SUM(P$10:P95)/O95","v":0.61627906976744184},2.1906944700959912]
[12.779684400457587,0.48639093676253742,0.48639093676253742,14.004729916977613,14.491120853740151,null,null,null,null,5,0.35416946878129629,15,20.354169468781297,null,87,1,{"$f":"SUM(P$10:P96)/O96","v":0.62068965517241381},-5.863048615041146]
[1.9889934544477583,1.1817470133505359,1.1817470133505359,12.990858879139312,14.172605892489848,null,null,null,null,5,3.6214032895221262,15,23.621403289522128,null,88,1,{"$f":"SUM(P$10:P97)/O97","v":0.625},-9.4487973970322798]
[18.707286376420839,16.076754269499553,16.076754269499553,15.047422143394742,31.124176412894293,null,null,null,null,5,1.8835276686994251,15,21.883527668699426,null,89,0,{"$f":"SUM(P$10:P98)/O98","v":0.6179775280898876},9.2406487441948677]
[1.3181247865108725,10.369215360486912,1.3181247865108725,14.828481750264771,16.146606536775643,null,null,null,null,5,3.1807726966149219,15,23.180772696614923,null,90,1,{"$f":"SUM(P$10:P99)/O99","v":0.62222222222222223},-7.0341661598392804]
[4.5363193578448735,10.882070563299811,4.5363193578448735,16.856209636037477,21.392528993882351,null,null,null,null,5,3.0509619338102483,15,23.05096193381025,null,91,1,{"$f":"SUM(P$10:P100)/O100","v":0.62637362637362637},-1.6584329399278985]
[15.109578234058771,7.9249902723821686,7.9249902723821686,14.24799857206224,22.172988844444408,null,null,null,null,5,4.0694101809447165,15,24.069410180944715,null,92,1,{"$f":"SUM(P$10:P101)/O101","v":0.63043478260869568},-1.8964213365003069]
[2.2236306826416707,9.5899281535081027,2.2236306826416707,13.761358689524116,15.984989372165787,null,null,null,null,5,2.6496071975246283,15,22.649607197524627,null,93,1,{"$f":"SUM(P$10:P102)/O102","v":0.63440860215053763},-6.6646178253588406]
[3.7488018142369683,14.414902846355242,3.7488018142369683,13.310326145669196,17.059127959906164,null,null,null,null,5,2.0359359964433583,15,22.035935996443357,null,94,1,{"$f":"SUM(P$10:P103)/O103","v":0.63829787234042556},-4.9768080365371929]
[13.066459730155222,10.597673599578396,10.597673599578396,15.377251750285499,25.974925349863895,null,null,null,null,5,2.5447041215329511,15,22.544704121532952,null,95,0,{"$f":"SUM(P$10:P104)/O104","v":0.63157894736842102},3.430221228330943]
[13.473934730204091,14.645933576311787,13.473934730204091,16.644686336803019,30.118621067007112,null,null,null,null,5,0.62638546738726653,15,20.626385467387266,null,96,0,{"$f":"SUM(P$10:P105)/O105","v":0.625},9.4922355996198462]
[4.1820627744557797,8.743579014599888,4.1820627744557797,12.647804570476318,16.829867344932097,null,null,null,null,5,4.6256262322813173,15,24.625626232281316,null,97,1,{"$f":"SUM(P$10:P106)/O106","v":0.62886597938144329},-7.7957588873492192]
[7.8300440907609108,12.307513632027426,7.8300440907609108,14.287177585682793,22.117221676443705,null,null,null,null,5,3.8408727682000361,15,23.840872768200036,null,98,1,{"$f":"SUM(P$10:P107)/O107","v":0.63265306122448983},-1.7236510917563308]
[10.475410260693028,6.2965627187090885,6.2965627187090885,13.48875416485664,19.785316883565727,null,null,null,null,5,2.0279531153428714,15,22.027953115342871,null,99,1,{"$f":"SUM(P$10:P108)/O108","v":0.63636363636363635},-2.2426362317771442]
[8.078052149912951,12.556391869132003,8.078052149912951,12.989935579936295,21.067987729849246,null,null,null,null,5,4.7011071959660811,15,24.701107195966081,null,100,1,{"$f":"SUM(P$10:P109)/O109","v":0.64},-3.6331194661168347]
[{"$f":"A$7+RAND()*A$8","v":16.5611926419238},12.982839662383581,12.982839662383581,14.975928062055768,27.958767724439348,null,null,null,null,5,3.0261139810594333,15,23.026113981059432,null,101,0,{"$f":"SUM(P$10:P110)/O110","v":0.63366336633663367},4.932653743379916]
[2.6573257187022437,7.2532612613713177,2.6573257187022437,17.492698537525758,20.150024256228001,null,null,null,null,5,1.303582072598866,15,21.303582072598864,null,102,1,{"$f":"SUM(P$10:P111)/O111","v":0.63725490196078427},-1.1535578163708635]
[10.91486145182726,6.2518220288917759,6.2518220288917759,16.887856579572443,23.139678608464219,null,null,null,null,5,4.920555156662954,15,24.920555156662953,null,103,1,{"$f":"SUM(P$10:P112)/O112","v":0.64077669902912626},-1.7808765481987336]
[2.4379714736688807,0.78329749411891525,0.78329749411891525,15.399811498309678,16.183108992428593,null,null,null,null,5,3.3655948269205158,15,23.365594826920514,null,104,1,{"$f":"SUM(P$10:P113)/O113","v":0.64423076923076927},-7.1824858344919207]
[11.675003789105354,5.5521814483120639,5.5521814483120639,12.203769601180296,17.75595104949236,null,null,null,null,5,0.145330625032975,15,20.145330625032976,null,105,1,{"$f":"SUM(P$10:P114)/O114","v":0.64761904761904765},-2.389379575540616]
[16.882389675890387,10.517886516737311,10.517886516737311,12.944627316806024,23.462513833543333,null,null,null,null,5,0.93164401045330414,15,20.931644010453304,null,106,0,{"$f":"SUM(P$10:P115)/O115","v":0.64150943396226412},2.5308698230900291]
[5.7684140373893573,19.937498784661184,5.7684140373893573,14.499449901162633,20.26786393855199,null,null,null,null,5,1.4140405585537135,15,21.414040558553715,null,107,1,{"$f":"SUM(P$10:P116)/O116","v":0.64485981308411211},-1.1461766200017252]
[2.9101678231892314,15.605118320899154,2.9101678231892314,15.30786318166315,18.218031004852381,null,null,null,null,5,3.5767798542450007,15,23.576779854245,null,108,1,{"$f":"SUM(P$10:P117)/O117","v":0.64814814814814814},-5.3587488493926188]
[2.5797722847585502,19.656170615843013,2.5797722847585502,15.917383190993831,18.497155475752383,null,null,null,null,5,0.83877988489828026,15,20.83877988489828,null,109,1,{"$f":"SUM(P$10:P118)/O118","v":0.65137614678899081},-2.3416244091458971]
[9.8252434652069258,2.6617248024854456,2.6617248024854456,13.515734572787187,16.177459375272633,null,null,null,null,5,1.8405428380993922,15,21.840542838099392,null,110,1,{"$f":"SUM(P$10:P119)/O119","v":0.65454545454545454},-5.6630834628267586]
[14.056019029835268,5.43345349269301,5.43345349269301,13.65080832127458,19.08426181396759,null,null,null,null,5,2.8178696876929923,15,22.817869687692991,null,111,1,{"$f":"SUM(P$10:P120)/O120","v":0.65765765765765771},-3.7336078737254006]
[8.6305800521563221,2.4757754092877082,2.4757754092877082,17.762956104124484,20.238731513412191,null,null,null,null,5,4.356349493630284,15,24.356349493630283,null,112,1,{"$f":"SUM(P$10:P121)/O121","v":0.6607142857142857},-4.1176179802180926]
[5.7933394913720671,15.312062146900804,5.7933394913720671,12.783944615160479,18.577284106532545,null,null,null,null,5,4.1087382726353532,15,24.108738272635353,null,113,1,{"$f":"SUM(P$10:P122)/O122","v":0.66371681415929207},-5.531454166102808]
[16.9636546633207,12.547939733776573,12.547939733776573,17.792179586255259,30.340119320031832,null,null,null,null,5,0.54577551772070299,15,20.545775517720703,null,114,0,{"$f":"SUM(P$10:P123)/O123","v":0.65789473684210531},9.7943438023111291]
[3.6942964101391684,13.98505034621177,3.6942964101391684,14.424987124651093,18.119283534790263,null,null,null,null,5,4.0476151904524986,15,24.047615190452497,null,115,1,{"$f":"SUM(P$10:P124)/O124","v":0.66086956521739126},-5.9283316556622339]
[2.5288339458050779,2.1026515963132453,2.1026515963132453,13.682633498832447,15.785285095145692,null,null,null,null,5,4.7962228133371045,15,24.796222813337103,null,116,1,{"$f":"SUM(P$10:P125)/O125","v":0.66379310344827591},-9.0109377181914105]
[14.937987079537628,10.548360800140152,10.548360800140152,14.608696285675579,25.15705708581573,null,null,null,null,5,0.31414961011525466,15,20.314149610115255,null,117,0,{"$f":"SUM(P$10:P126)/O126","v":0.65811965811965811},4.8429074757004749]
[19.344850766610968,9.5798202714390044,9.5798202714390044,17.872884722700363,27.452704994139367,null,null,null,null,5,0.37071532108502281,15,20.370715321085022,null,118,0,{"$f":"SUM(P$10:P127)/O127","v":0.65254237288135597},7.0819896730543448]
[9.470803970429138,5.1578524549160942,5.1578524549160942,15.85376206888726,21.011614523803352,null,null,null,null,5,0.4426701655816484,15,20.442670165581646,null,119,0,{"$f":"SUM(P$10:P128)/O128","v":0.6470588235294118},0.56894435822170664]
[9.1679669280851872,6.7335833259366034,6.7335833259366034,13.956644225126638,20.690227551063241,null,null,null,null,5,0.69805124527047846,15,20.698051245270477,null,120,1,{"$f":"SUM(P$10:P129)/O129","v":0.65},-7.8236942072358318E-3]
[{"$f":"A$7+RAND()*A$8","v":3.6194854003464805},5.1664097323954543,3.6194854003464805,14.642234169929591,18.261719570276071,null,null,null,null,5,0.55225114078967741,15,20.552251140789679,null,121,1,{"$f":"SUM(P$10:P130)/O130","v":0.65289256198347112},-2.2905315705136076]
[18.318460713133057,6.8856868128024988,6.8856868128024988,15.717854607066101,22.603541419868598,null,null,null,null,5,2.1324029330115857,15,22.132402933011587,null,122,0,{"$f":"SUM(P$10:P131)/O131","v":0.64754098360655743},0.47113848685701143]
[13.905966068275957,13.191894756712239,13.191894756712239,15.715568348600481,28.907463105312722,null,null,null,null,5,3.6601485851656355,15,23.660148585165636,null,123,0,{"$f":"SUM(P$10:P132)/O132","v":0.64227642276422769},5.2473145201470857]
[9.367154645656564,4.7046555035619164,4.7046555035619164,17.34966536992685,22.054320873488766,null,null,null,null,5,2.5403646660768571,15,22.540364666076858,null,124,1,{"$f":"SUM(P$10:P133)/O133","v":0.64516129032258063},-0.48604379258809161]
[7.8013170244348657,16.088423162008134,7.8013170244348657,12.29538207855043,20.096699102985298,null,null,null,null,5,2.5322669381173188,15,22.532266938117317,null,125,1,{"$f":"SUM(P$10:P134)/O134","v":0.64800000000000002},-2.4355678351320194]
[6.2593469201858003,8.6095248584050861,6.2593469201858003,14.139824813328218,20.399171733514017,null,null,null,null,5,0.53212660520855493,15,20.532126605208553,null,126,1,{"$f":"SUM(P$10:P135)/O135","v":0.65079365079365081},-0.13295487169453679]
[12.945675016844415,12.529394334994219,12.529394334994219,12.845731462805874,25.375125797800095,null,null,null,null,5,0.63295887304453735,15,20.632958873044537,null,127,0,{"$f":"SUM(P$10:P136)/O136","v":0.64566929133858264},4.7421669247555585]
[11.963781904903364,0.98776175973552149,0.98776175973552149,16.874578756862526,17.862340516598046,null,null,null,null,5,1.6063602038181735,15,21.606360203818173,null,128,1,{"$f":"SUM(P$10:P137)/O137","v":0.6484375},-3.7440196872201277]
[10.089604412644791,19.159731559846371,{"$f":"MIN(A138:B138)","v":10.089604412644791},{"$f":"D$7+RAND()*D$8","v":17.272677524503351},{"$f":"D138+C138","v":27.36228193714814},null,null,null,null,5,{"$f":"K$7+RAND()*K$8","v":1.0875609945618074},15,{"$f":"L138+K138+J138","v":21.087560994561809},null,129,{"$f":"(E138<M138)*1","v":0},{"$f":"SUM(P$10:P138)/O138","v":0.64341085271317833},{"$f":"E138-M138","v":6.2747209425863311}]
[7.3448256142272683,13.47322064715163,7.3448256142272683,16.885947594290975,24.230773208518244,null,null,null,null,5,0.80268310615938421,15,20.802683106159385,null,{"$f":"O138+1","v":130},0,{"$f":"SUM(P$10:P139)/O139","v":0.63846153846153841},3.4280901023588584]
[12.661890420907982,4.8031098678636059,4.8031098678636059,14.942715715398778,19.745825583262384,null,null,null,null,5,4.6976886649081351,15,24.697688664908135,null,131,1,{"$f":"SUM(P$10:P140)/O140","v":0.64122137404580148},-4.951863081645751]
[7.4286643405583135,12.388171286908257,7.4286643405583135,16.122260176544525,23.550924517102839,null,null,null,null,5,0.35446921942901555,15,20.354469219429014,null,132,0,{"$f":"SUM(P$10:P141)/O141","v":0.63636363636363635},3.1964552976738254]
[1.2435930825065755,10.025561393352568,1.2435930825065755,15.173038400591288,16.416631483097863,null,null,null,null,5,1.3156358670251589,15,21.315635867025158,null,133,1,{"$f":"SUM(P$10:P142)/O142","v":0.63909774436090228},-4.899004383927295]
[6.3086106672881765,15.961348673388219,6.3086106672881765,17.474551034218536,23.783161701506714,null,null,null,null,5,2.7690672286068212,15,22.769067228606822,null,134,0,{"$f":"SUM(P$10:P143)/O143","v":0.63432835820895528},1.0140944728998917]
[18.050291991176756,10.899070636795702,10.899070636795702,14.936153995667894,25.835224632463596,null,null,null,null,5,1.6528375777823108,15,21.652837577782311,null,135,0,{"$f":"SUM(P$10:P144)/O144","v":0.62962962962962965},4.1823870546812856]
[15.052263950160278,7.2342616920994356,7.2342616920994356,16.129681388258625,23.363943080358062,null,null,null,null,5,3.303673394512515,15,23.303673394512515,null,136,0,{"$f":"SUM(P$10:P145)/O145","v":0.625},6.0269685845547372E-2]
[11.493269584612587,13.896193421652709,11.493269584612587,15.07051258666471,26.563782171277296,null,null,null,null,5,2.5323335680564982,15,22.532333568056497,null,137,0,{"$f":"SUM(P$10:P146)/O146","v":0.62043795620437958},4.0314486032207988]
[9.4460823144874908,8.646736275983077,8.646736275983077,16.00014793896904,24.646884214952117,null,null,null,null,5,1.0631248591167459,15,21.063124859116748,null,138,0,{"$f":"SUM(P$10:P147)/O147","v":0.61594202898550721},3.5837593558353689]
[4.5177317383610998,8.2832603487423899,4.5177317383610998,13.980493674961522,18.498225413322622,null,null,null,null,5,2.6388301385272142,15,22.638830138527215,null,139,1,{"$f":"SUM(P$10:P148)/O148","v":0.61870503597122306},-4.140604725204593]
[12.953327454997513,12.682742526019172,12.682742526019172,13.331690541670621,26.014433067689794,null,null,null,null,5,3.1277224282081844,15,23.127722428208184,null,140,0,{"$f":"SUM(P$10:P149)/O149","v":0.61428571428571432},2.8867106394816098]
[{"$f":"A$7+RAND()*A$8","v":6.0409521345335815},14.790209652911557,6.0409521345335815,16.79675932350861,22.837711458042193,null,null,null,null,5,0.78145400368577145,15,20.781454003685774,null,141,0,{"$f":"SUM(P$10:P150)/O150","v":0.60992907801418439},2.0562574543564196]
[19.932404828447929,6.7078837375697953,6.7078837375697953,12.633659883457975,19.341543621027771,null,null,null,null,5,2.0413392127115637,15,22.041339212711563,null,142,1,{"$f":"SUM(P$10:P151)/O151","v":0.61267605633802813},-2.6997955916837917]
[9.7285886160959798,15.576465125567287,9.7285886160959798,15.181523161089803,24.910111777185783,null,null,null,null,5,4.1898926858944341,15,24.189892685894435,null,143,0,{"$f":"SUM(P$10:P152)/O152","v":0.60839160839160844},0.72021909129134798]
[6.6831442845075166,2.3880145683329834,2.3880145683329834,17.891622748690594,20.279637317023578,null,null,null,null,5,1.595743387345649,15,21.595743387345649,null,144,1,{"$f":"SUM(P$10:P153)/O153","v":0.61111111111111116},-1.3161060703220713]
[2.698215044136778,17.615737639151543,2.698215044136778,17.080039988663763,19.778255032800541,null,null,null,null,5,6.0061986549083679E-2,15,20.060061986549083,null,145,1,{"$f":"SUM(P$10:P154)/O154","v":0.61379310344827587},-0.28180695374854281]
[3.8142011503760331,17.223782607035435,3.8142011503760331,12.322499688575197,16.136700838951231,null,null,null,null,5,4.7468300881661891,15,24.746830088166188,null,146,1,{"$f":"SUM(P$10:P155)/O155","v":0.61643835616438358},-8.6101292492149568]
[5.3376025574270596,3.4125253813242074,3.4125253813242074,13.556815440250082,16.969340821574288,null,null,null,null,5,1.6514817535119923,15,21.651481753511991,null,147,1,{"$f":"SUM(P$10:P156)/O156","v":0.61904761904761907},-4.6821409319377025]
[6.6288041488263172,3.1946510113896309,3.1946510113896309,12.318334709924935,15.512985721314566,null,null,null,null,5,4.2545716562398095,15,24.254571656239811,null,148,1,{"$f":"SUM(P$10:P157)/O157","v":0.6216216216216216},-8.7415859349252454]
[12.360922757435695,3.066964538828536,3.066964538828536,13.394432576124203,16.461397114952739,null,null,null,null,5,2.8436987852929665,15,22.843698785292965,null,149,1,{"$f":"SUM(P$10:P158)/O158","v":0.62416107382550334},-6.382301670340226]
[8.481798078895693,8.6724503095754368,8.481798078895693,15.433775168406093,23.915573247301786,null,null,null,null,5,2.8367571188303953,15,22.836757118830395,null,150,0,{"$f":"SUM(P$10:P159)/O159","v":0.62},1.0788161284713915]
[8.701595223701986,10.705165402806012,8.701595223701986,14.112336614103029,22.813931837805015,null,null,null,null,5,3.2071207693023309,15,23.207120769302332,null,151,1,{"$f":"SUM(P$10:P160)/O160","v":0.62251655629139069},-0.39318893149731693]
[3.7408628362830409,11.21943638383758,3.7408628362830409,15.521399487772879,19.262262324055918,null,null,null,null,5,3.7405644045260287,15,23.74056440452603,null,152,1,{"$f":"SUM(P$10:P161)/O161","v":0.625},-4.4783020804701117]
[1.1232421137166604,8.5188649847953499,1.1232421137166604,14.68391170210332,15.80715381581998,null,null,null,null,5,1.489343573662572,15,21.489343573662573,null,153,1,{"$f":"SUM(P$10:P162)/O162","v":0.62745098039215685},-5.6821897578425933]
[19.325944991580347,19.682809782113679,19.325944991580347,17.29950396995423,36.625448961534573,null,null,null,null,5,1.1820017433561358,15,21.182001743356135,null,154,0,{"$f":"SUM(P$10:P163)/O163","v":0.62337662337662336},15.443447218178438]
[10.31229038511276,1.7779576224122051,1.7779576224122051,15.09087499807487,16.868832620487076,null,null,null,null,5,3.8678023827119472,15,23.867802382711947,null,155,1,{"$f":"SUM(P$10:P164)/O164","v":0.62580645161290327},-6.9989697622248705]
[17.954615794577631,1.6070076499256714,1.6070076499256714,12.218341639964374,13.825349289890045,null,null,null,null,5,4.5767028285255327,15,24.576702828525534,null,156,1,{"$f":"SUM(P$10:P165)/O165","v":0.62820512820512819},-10.751353538635488]
[10.441241113054316,4.401059682075914,4.401059682075914,17.222359800821444,21.623419482897358,null,null,null,null,5,1.6850540462857311,15,21.685054046285732,null,157,1,{"$f":"SUM(P$10:P166)/O166","v":0.63057324840764328},-6.163456338837392E-2]
[17.772162652791835,13.350584827215624,13.350584827215624,16.130429987301461,29.481014814517085,null,null,null,null,5,1.2270434724775747,15,21.227043472477575,null,158,0,{"$f":"SUM(P$10:P167)/O167","v":0.62658227848101267},8.2539713420395096]
[1.4129795773070519,9.9535516159473403,1.4129795773070519,16.072262462937527,17.485242040244579,null,null,null,null,5,2.5032296593266952,15,22.503229659326696,null,159,1,{"$f":"SUM(P$10:P168)/O168","v":0.62893081761006286},-5.0179876190821169]
[2.8025690744673271,16.691873931798366,2.8025690744673271,13.572314055159389,16.374883129626717,null,null,null,null,5,3.4135718819563792,15,23.413571881956379,null,160,1,{"$f":"SUM(P$10:P169)/O169","v":0.63124999999999998},-7.0386887523296622]
[{"$f":"A$7+RAND()*A$8","v":19.243100583881407},17.714501715859484,17.714501715859484,16.164125706320938,33.878627422180422,null,null,null,null,5,2.9441553798745774,15,22.944155379874577,null,161,0,{"$f":"SUM(P$10:P170)/O170","v":0.62732919254658381},10.934472042305845]
[0.16055768713880703,9.938989915231808,0.16055768713880703,17.491933764942502,17.652491452081307,null,null,null,null,5,0.51680640936547562,15,20.516806409365476,null,162,1,{"$f":"SUM(P$10:P171)/O171","v":0.62962962962962965},-2.8643149572841686]
[10.050465195061866,12.238006903423715,10.050465195061866,13.414431524564115,23.464896719625983,null,null,null,null,5,4.0181890442718178,15,24.018189044271818,null,163,1,{"$f":"SUM(P$10:P172)/O172","v":0.63190184049079756},-0.55329232464583455]
[11.931354269792038,18.627898947441931,11.931354269792038,14.849435335442685,26.780789605234723,null,null,null,null,5,4.6727815553487728,15,24.672781555348774,null,164,0,{"$f":"SUM(P$10:P173)/O173","v":0.62804878048780488},2.1080080498859495]
[19.794881962397596,12.396374679072919,12.396374679072919,12.782036809155874,25.178411488228793,null,null,null,null,5,2.7402542280116511,15,22.740254228011651,null,165,0,{"$f":"SUM(P$10:P174)/O174","v":0.62424242424242427},2.4381572602171424]
[1.4863821549857859,2.4464396725849435,1.4863821549857859,17.81630134174236,19.302683496728147,null,null,null,null,5,2.9007502896440029,15,22.900750289644002,null,166,1,{"$f":"SUM(P$10:P175)/O175","v":0.62650602409638556},-3.598066792915855]
[15.878419894454998,10.397020365953409,10.397020365953409,13.75546903260342,24.152489398556831,null,null,null,null,5,4.4072993044627644,15,24.407299304462764,null,167,1,{"$f":"SUM(P$10:P176)/O176","v":0.62874251497005984},-0.25480990590593322]
[9.1677494683602561,3.92501722713682,3.92501722713682,17.77175763164141,21.69677485877823,null,null,null,null,5,4.6222427578664167,15,24.622242757866417,null,168,1,{"$f":"SUM(P$10:P177)/O177","v":0.63095238095238093},-2.9254678990881864]
[3.9121898271476341,5.4214102338296399,3.9121898271476341,15.24918586220304,19.161375689350674,null,null,null,null,5,3.2119610863600339,15,23.211961086360034,null,169,1,{"$f":"SUM(P$10:P178)/O178","v":0.63313609467455623},-4.0505853970093604]
[1.7779744004567233,16.957514293012249,1.7779744004567233,12.380189241865951,14.158163642322673,null,null,null,null,5,3.3440442503018808,15,23.344044250301881,null,170,1,{"$f":"SUM(P$10:P179)/O179","v":0.63529411764705879},-9.1858806079792075]
[2.4188123037763742,19.417078594239207,2.4188123037763742,15.849442411700016,18.268254715476392,null,null,null,null,5,1.6649629704341735,15,21.664962970434175,null,171,1,{"$f":"SUM(P$10:P180)/O180","v":0.63742690058479534},-3.3967082549577832]
[15.972822649335956,0.54520911461781063,0.54520911461781063,14.596862361946288,15.142071476564098,null,null,null,null,5,2.7542533460394791,15,22.75425334603948,null,172,1,{"$f":"SUM(P$10:P181)/O181","v":0.63953488372093026},-7.612181869475382]
[2.3625842065728908,3.8564067659817614,2.3625842065728908,12.621020929085805,14.983605135658696,null,null,null,null,5,3.6221017637831605,15,23.62210176378316,null,173,1,{"$f":"SUM(P$10:P182)/O182","v":0.64161849710982655},-8.6384966281244644]
[18.588971786135282,18.259771424007681,18.259771424007681,14.333902960021579,32.593674384029256,null,null,null,null,5,2.9411699915541933,15,22.941169991554194,null,174,0,{"$f":"SUM(P$10:P183)/O183","v":0.63793103448275867},9.6525043924750626]
[15.77556300754069,11.387268202974031,11.387268202974031,13.541653949620942,24.928922152594971,null,null,null,null,5,4.3711272553749323,15,24.371127255374933,null,175,0,{"$f":"SUM(P$10:P184)/O184","v":0.63428571428571423},0.55779489722003817]
[18.025901255808126,1.0547500814568145,1.0547500814568145,13.981532229564714,15.036282311021528,null,null,null,null,5,4.2703920274464906,15,24.270392027446491,null,176,1,{"$f":"SUM(P$10:P185)/O185","v":0.63636363636363635},-9.2341097164249621]
[4.0689372163500659,8.1082646195237924,4.0689372163500659,13.452480054384266,17.521417270734332,null,null,null,null,5,8.7129561246580001E-2,15,20.087129561246581,null,177,1,{"$f":"SUM(P$10:P186)/O186","v":0.6384180790960452},-2.5657122905122485]
[7.3929858114847065,2.5896909110163335,2.5896909110163335,15.181259537772622,17.770950448788955,null,null,null,null,5,2.8600854807481353,15,22.860085480748136,null,178,1,{"$f":"SUM(P$10:P187)/O187","v":0.6404494382022472},-5.0891350319591808]
[0.35333572832190185,11.177879624116045,0.35333572832190185,12.14429836785385,12.497634096175751,null,null,null,null,5,3.1966888913563904,15,23.196688891356391,null,179,1,{"$f":"SUM(P$10:P188)/O188","v":0.64245810055865926},-10.69905479518064]
[10.838012104663754,18.386548871468772,10.838012104663754,13.21144782390687,24.049459928570624,null,null,null,null,5,3.5913954687686407,15,23.591395468768642,null,180,0,{"$f":"SUM(P$10:P189)/O189","v":0.63888888888888884},0.45806445980198163]
[{"$f":"A$7+RAND()*A$8","v":19.915997761427462},3.0390261086878145,3.0390261086878145,13.291972369587302,16.330998478275117,null,null,null,null,5,1.057167281419416,15,21.057167281419417,null,181,1,{"$f":"SUM(P$10:P190)/O190","v":0.64088397790055252},-4.7261688031443008]
[1.8505570836850782,8.868949972134299,1.8505570836850782,12.306252765461057,14.156809849146136,null,null,null,null,5,1.3672284794796941,15,21.367228479479692,null,182,1,{"$f":"SUM(P$10:P191)/O191","v":0.6428571428571429},-7.2104186303335567]
[6.0012778785292076,1.0699661785094339,1.0699661785094339,15.981657490598877,17.051623669108309,null,null,null,null,5,4.0797350673841519,15,24.079735067384153,null,183,1,{"$f":"SUM(P$10:P192)/O192","v":0.64480874316939896},-7.0281113982758434]
[8.0957795908721017,17.454696834141803,8.0957795908721017,17.322007343395569,25.417786934267671,null,null,null,null,5,4.5593407452853594,15,24.559340745285361,null,184,0,{"$f":"SUM(P$10:P193)/O193","v":0.64130434782608692},0.85844618898230962]
[3.3360572824261392,18.415756854175235,3.3360572824261392,12.01936044749224,15.355417729918379,null,null,null,null,5,4.5085545904486004,15,24.5085545904486,null,185,1,{"$f":"SUM(P$10:P194)/O194","v":0.64324324324324322},-9.1531368605302212]
[19.792475789544685,17.771054845859982,17.771054845859982,14.065473434205565,31.836528280065547,null,null,null,null,5,0.11716044085088972,15,20.117160440850888,null,186,0,{"$f":"SUM(P$10:P195)/O195","v":0.63978494623655913},11.719367839214659]
[2.1261527221333276,4.0676463766548565,2.1261527221333276,15.221176946429203,17.34732966856253,null,null,null,null,5,0.1993927821451702,15,20.199392782145168,null,187,1,{"$f":"SUM(P$10:P196)/O196","v":0.64171122994652408},-2.8520631135826378]
[17.393413773299127,0.34650104887836264,0.34650104887836264,16.818476446277362,17.164977495155725,null,null,null,null,5,1.5563681206431861,15,21.556368120643185,null,188,1,{"$f":"SUM(P$10:P197)/O197","v":0.6436170212765957},-4.3913906254874604]
[7.508519250388817,8.5607158219545827,7.508519250388817,16.038072700853348,23.546591951242164,null,null,null,null,5,3.9336532220591192,15,23.933653222059121,null,189,1,{"$f":"SUM(P$10:P198)/O198","v":0.64550264550264547},-0.3870612708169574]
[19.436705451035078,1.5452026287508014,1.5452026287508014,13.672427811779261,15.217630440530062,null,null,null,null,5,3.6077495594226852,15,23.607749559422686,null,190,1,{"$f":"SUM(P$10:P199)/O199","v":0.64736842105263159},-8.3901191188926241]
[9.8009403014517122,11.650510931535486,9.8009403014517122,13.744019987570406,23.544960289022118,null,null,null,null,5,1.1906363828364364,15,21.190636382836438,null,191,0,{"$f":"SUM(P$10:P200)/O200","v":0.64397905759162299},2.3543239061856802]
[12.326177232119948,13.629382232728274,12.326177232119948,13.524351015166555,25.850528247286505,null,null,null,null,5,7.5140029285002963E-2,15,20.075140029285002,null,192,0,{"$f":"SUM(P$10:P201)/O201","v":0.640625},5.7753882180015026]
[13.90647167938643,9.0891465023321754,{"$f":"MIN(A202:B202)","v":9.0891465023321754},{"$f":"D$7+RAND()*D$8","v":16.220621097094607},{"$f":"D202+C202","v":25.309767599426785},null,null,null,null,5,{"$f":"K$7+RAND()*K$8","v":2.2181270286367245},15,{"$f":"L202+K202+J202","v":22.218127028636726},null,193,{"$f":"(E202<M202)*1","v":0},{"$f":"SUM(P$10:P202)/O202","v":0.63730569948186533},{"$f":"E202-M202","v":3.0916405707900587}]
[9.9801008977305301,8.4866908790189335,8.4866908790189335,14.632753928053724,23.119444807072657,null,null,null,null,5,3.8346129160001023,15,23.834612916000104,null,{"$f":"O202+1","v":194},1,{"$f":"SUM(P$10:P203)/O203","v":0.63917525773195871},-0.71516810892744687]
[16.28962947983765,15.641926161222568,15.641926161222568,14.170114635151094,29.812040796373662,null,null,null,null,5,3.5931602716356625,15,23.593160271635661,null,195,0,{"$f":"SUM(P$10:P204)/O204","v":0.63589743589743586},6.218880524738001]
[4.6656090614135852,7.8762398535674105,4.6656090614135852,13.313009713806945,17.978618775220532,null,null,null,null,5,0.29852429524192037,15,20.298524295241918,null,196,1,{"$f":"SUM(P$10:P205)/O205","v":0.63775510204081631},-2.3199055200213863]
[11.753637049009127,17.579466110545962,11.753637049009127,13.804019019895659,25.557656068904784,null,null,null,null,5,3.7254423486295618,15,23.725442348629564,null,197,0,{"$f":"SUM(P$10:P206)/O206","v":0.63451776649746194},1.8322137202752202]
[1.0827800311955071,9.4425305329104443,1.0827800311955071,16.056649133453416,17.139429164648924,null,null,null,null,5,1.0035709031454405,15,21.003570903145441,null,198,1,{"$f":"SUM(P$10:P207)/O207","v":0.63636363636363635},-3.8641417384965173]
[6.7655913008350659,14.158331870949961,6.7655913008350659,13.028735864460785,19.794327165295851,null,null,null,null,5,3.3111425062213682,15,23.311142506221369,null,199,1,{"$f":"SUM(P$10:P208)/O208","v":0.63819095477386933},-3.5168153409255183]
[2.2191188887498781,19.941636247228558,2.2191188887498781,13.469399288574829,15.688518177324706,null,null,null,null,5,4.4801168757491983,15,24.480116875749196,null,200,1,{"$f":"SUM(P$10:P209)/O209","v":0.64},-8.7915986984244903]
[{"$f":"A$7+RAND()*A$8","v":1.2127058023682613},7.9435982408273027,1.2127058023682613,17.096747798807183,18.309453601175445,null,null,null,null,5,1.2410856984615415E-2,15,20.012410856984616,null,201,1,{"$f":"SUM(P$10:P210)/O210","v":0.64179104477611937},-1.7029572558091708]
[11.902647113861676,8.0293183283974159,8.0293183283974159,15.400111682002308,23.429430010399724,null,null,null,null,5,4.6416203428883431,15,24.641620342888345,null,202,1,{"$f":"SUM(P$10:P211)/O211","v":0.64356435643564358},-1.2121903324886212]
[4.535992585152604,10.641963098876712,4.535992585152604,13.939648861074863,18.475641446227467,null,null,null,null,5,0.56401171011952633,15,20.564011710119527,null,203,1,{"$f":"SUM(P$10:P212)/O212","v":0.64532019704433496},-2.0883702638920596]
[14.333054358577062,10.233981417361889,10.233981417361889,12.986214885202173,23.220196302564062,null,null,null,null,5,1.8434689267062114,15,21.843468926706212,null,204,0,{"$f":"SUM(P$10:P213)/O213","v":0.64215686274509809},1.3767273758578504]
[16.652734616923865,16.631317230156782,16.631317230156782,13.595549884938201,30.226867115094983,null,null,null,null,5,0.20816731636316144,15,20.208167316363159,null,205,0,{"$f":"SUM(P$10:P214)/O214","v":0.63902439024390245},10.018699798731824]
[0.44955379250823713,5.0508397403350873,0.44955379250823713,12.699343629562682,13.148897422070918,null,null,null,null,5,1.6796676462460862,15,21.679667646246088,null,206,1,{"$f":"SUM(P$10:P215)/O215","v":0.64077669902912626},-8.5307702241751695]
[9.8825238807855182,15.474770165286571,9.8825238807855182,17.998598869574412,27.881122750359928,null,null,null,null,5,3.5251797165840468,15,23.525179716584049,null,207,0,{"$f":"SUM(P$10:P216)/O216","v":0.6376811594202898},4.3559430337758798]
[4.195631152460269,8.8780974897733227,4.195631152460269,17.746323159183714,21.941954311643983,null,null,null,null,5,0.71681218832094218,15,20.716812188320944,null,208,0,{"$f":"SUM(P$10:P217)/O217","v":0.63461538461538458},1.2251421233230388]
[1.6110051974754191,19.737025708147506,1.6110051974754191,12.137590647349422,13.748595844824841,null,null,null,null,5,0.30617113917698668,15,20.306171139176989,null,209,1,{"$f":"SUM(P$10:P218)/O218","v":0.63636363636363635},-6.5575752943521479]
[18.04784264773328,15.106021692191709,15.106021692191709,13.611084337845856,28.717106030037563,null,null,null,null,5,2.7739873703137792,15,22.77398737031378,null,210,0,{"$f":"SUM(P$10:P219)/O219","v":0.6333333333333333},5.9431186597237833]
[10.644321339323801,9.3592951020275841,9.3592951020275841,12.248559514373207,21.607854616400793,null,null,null,null,5,0.3350417002443129,15,20.335041700244311,null,211,0,{"$f":"SUM(P$10:P220)/O220","v":0.63033175355450233},1.2728129161564823]
[2.9980007047177537,10.023104559210863,2.9980007047177537,16.516714259886093,19.514714964603847,null,null,null,null,5,2.899565361614076,15,22.899565361614076,null,212,1,{"$f":"SUM(P$10:P221)/O221","v":0.63207547169811318},-3.3848503970102293]
[14.949758453804394,5.3481575467536508,5.3481575467536508,13.239364779350165,18.587522326103816,null,null,null,null,5,3.8620404117665301,15,23.862040411766529,null,213,1,{"$f":"SUM(P$10:P222)/O222","v":0.63380281690140849},-5.274518085662713]
[3.0508386227899398,17.335668667093557,3.0508386227899398,14.887205325731619,17.93804394852156,null,null,null,null,5,2.9694108353645738,15,22.969410835364574,null,214,1,{"$f":"SUM(P$10:P223)/O223","v":0.63551401869158874},-5.0313668868430135]
[9.1421532279117628,2.8104706770772658,2.8104706770772658,14.925375975341044,17.73584665241831,null,null,null,null,5,3.7008786257156752,15,23.700878625715674,null,215,1,{"$f":"SUM(P$10:P224)/O224","v":0.63720930232558137},-5.9650319732973642]
[18.733039960321744,0.7925765625980441,0.7925765625980441,15.099735162565745,15.89231172516379,null,null,null,null,5,4.1689482680727261,15,24.168948268072725,null,216,1,{"$f":"SUM(P$10:P225)/O225","v":0.63888888888888884},-8.2766365429089355]
[1.7204366423296791,11.393447819203995,1.7204366423296791,17.282366203180029,19.002802845509709,null,null,null,null,5,3.6902666393547601,15,23.690266639354761,null,217,1,{"$f":"SUM(P$10:P226)/O226","v":0.64055299539170507},-4.6874637938450512]
[2.5989920472409844,14.663081124432924,2.5989920472409844,14.301017010463427,16.900009057704413,null,null,null,null,5,2.5850036630884614,15,22.585003663088461,null,218,1,{"$f":"SUM(P$10:P227)/O227","v":0.64220183486238536},-5.6849946053840483]
[13.382364268486642,9.8860236229318073,9.8860236229318073,16.504242947512047,26.390266570443856,null,null,null,null,5,1.6751010768430885,15,21.675101076843088,null,219,0,{"$f":"SUM(P$10:P228)/O228","v":0.63926940639269403},4.7151654936007681]
[16.148847783623943,12.353027827183915,12.353027827183915,13.113527873250709,25.466555700434625,null,null,null,null,5,3.892090833899911,15,23.892090833899911,null,220,0,{"$f":"SUM(P$10:P229)/O229","v":0.63636363636363635},1.574464866534715]
[{"$f":"A$7+RAND()*A$8","v":13.54016242451908},4.0265224534273365,4.0265224534273365,17.457211204299497,21.483733657726834,null,null,null,null,5,1.9175732149910762,15,21.917573214991076,null,221,1,{"$f":"SUM(P$10:P230)/O230","v":0.63800904977375561},-0.43383955726424261]
[5.5629254533013039,11.557363008904321,5.5629254533013039,12.0852276893813,17.648153142682602,null,null,null,null,5,3.3792185972215609,15,23.379218597221559,null,222,1,{"$f":"SUM(P$10:P231)/O231","v":0.63963963963963966},-5.7310654545389568]
[1.0520727383922646,12.649392469928934,1.0520727383922646,15.130255226310073,16.182327964702338,null,null,null,null,5,2.7889151198529198,15,22.78891511985292,null,223,1,{"$f":"SUM(P$10:P232)/O232","v":0.64125560538116588},-6.6065871551505815]
[5.5807997295748546,8.4603186706586442,5.5807997295748546,17.028430622284041,22.609230351858898,null,null,null,null,5,1.370906574860677,15,21.370906574860676,null,224,0,{"$f":"SUM(P$10:P233)/O233","v":0.6383928571428571},1.2383237769982216]
[15.807937520480486,18.908626085840893,15.807937520480486,16.865243951033278,32.673181471513765,null,null,null,null,5,2.3815542144640203,15,22.381554214464021,null,225,0,{"$f":"SUM(P$10:P234)/O234","v":0.63555555555555554},10.291627257049743]
[3.3338679842979668,3.632732138174497,3.3338679842979668,13.296699841316119,16.630567825614087,null,null,null,null,5,2.1712906741215554,15,22.171290674121554,null,226,1,{"$f":"SUM(P$10:P235)/O235","v":0.63716814159292035},-5.5407228485074675]
[11.13935198793968,12.37831962207855,11.13935198793968,13.408548864199195,24.547900852138874,null,null,null,null,5,4.7896598640430961,15,24.789659864043095,null,227,1,{"$f":"SUM(P$10:P236)/O236","v":0.63876651982378851},-0.24175901190422167]
[7.475535184447506,10.484325019936705,7.475535184447506,13.127922164765186,20.603457349212693,null,null,null,null,5,2.7799309269021006,15,22.7799309269021,null,228,1,{"$f":"SUM(P$10:P237)/O237","v":0.64035087719298245},-2.1764735776894071]
[16.228705444506929,13.619093300819376,13.619093300819376,13.758666651171438,27.377759951990814,null,null,null,null,5,2.5644183476239881,15,22.564418347623988,null,229,0,{"$f":"SUM(P$10:P238)/O238","v":0.63755458515283847},4.8133416043668262]
[18.862750952889048,4.0125722411578142,4.0125722411578142,14.868862505072544,18.881434746230358,null,null,null,null,5,2.1340608698475676,15,22.134060869847566,null,230,1,{"$f":"SUM(P$10:P239)/O239","v":0.63913043478260867},-3.2526261236172083]
[0.93324259690820588,3.5802002630588414,0.93324259690820588,17.477160916903344,18.410403513811548,null,null,null,null,5,0.79843492661024751,15,20.798434926610248,null,231,1,{"$f":"SUM(P$10:P240)/O240","v":0.64069264069264065},-2.3880314127986999]
[1.5738690635256902,13.480348111617634,1.5738690635256902,14.998145998567219,16.572015062092909,null,null,null,null,5,4.3898343497311902,15,24.389834349731188,null,232,1,{"$f":"SUM(P$10:P241)/O241","v":0.64224137931034486},-7.8178192876382795]
[0.22795581053658642,11.874406952486471,0.22795581053658642,12.637262270616061,12.865218081152648,null,null,null,null,5,1.4621300736246301,15,21.462130073624628,null,233,1,{"$f":"SUM(P$10:P242)/O242","v":0.64377682403433478},-8.5969119924719806]
[15.320889873997615,16.485338935102494,15.320889873997615,14.579248950883951,29.900138824881566,null,null,null,null,5,4.9014489678790785,15,24.901448967879077,null,234,0,{"$f":"SUM(P$10:P243)/O243","v":0.64102564102564108},4.9986898570024891]
[1.8135901414918854,9.8184416041747973,1.8135901414918854,15.306069217215722,17.119659358707608,null,null,null,null,5,4.403379138725489,15,24.403379138725491,null,235,1,{"$f":"SUM(P$10:P244)/O244","v":0.64255319148936174},-7.2837197800178828]
[6.2262532146184828,18.093677623690379,6.2262532146184828,17.787850464444322,24.014103679062806,null,null,null,null,5,2.5370582104244561,15,22.537058210424455,null,236,0,{"$f":"SUM(P$10:P245)/O245","v":0.63983050847457623},1.4770454686383516]
[19.367647405255589,14.146961454106011,14.146961454106011,14.86469480804578,29.011656262151789,null,null,null,null,5,1.2666741359248164,15,21.266674135924816,null,237,0,{"$f":"SUM(P$10:P246)/O246","v":0.6371308016877637},7.7449821262269722]
[4.663673364779557,19.423627205531702,4.663673364779557,14.079404850423876,18.743078215203433,null,null,null,null,5,4.813731841020191,15,24.813731841020193,null,238,1,{"$f":"SUM(P$10:P247)/O247","v":0.6386554621848739},-6.0706536258167603]
[19.827517518151421,17.353433653765766,17.353433653765766,17.115652698971065,34.469086352736831,null,null,null,null,5,2.4435662872765413,15,22.443566287276543,null,239,0,{"$f":"SUM(P$10:P248)/O248","v":0.63598326359832635},12.025520065460288]
[8.7924261884431036,10.079021329745057,8.7924261884431036,13.47435366031484,22.266779848757942,null,null,null,null,5,2.6200655679923952,15,22.620065567992395,null,240,1,{"$f":"SUM(P$10:P249)/O249","v":0.63749999999999996},-0.35328571923445296]
[{"$f":"A$7+RAND()*A$8","v":0.3232641542212078},10.501203675365186,0.3232641542212078,16.105829408600009,16.429093562821215,null,null,null,null,5,2.7709496253607662,15,22.770949625360767,null,241,1,{"$f":"SUM(P$10:P250)/O250","v":0.63900414937759331},-6.3418560625395521]
[4.7060605106614783,16.952612038533573,4.7060605106614783,17.182338588828813,21.888399099490293,null,null,null,null,5,3.799584764612995,15,23.799584764612995,null,242,1,{"$f":"SUM(P$10:P251)/O251","v":0.64049586776859502},-1.9111856651227015]
[13.166557030180876,10.676949786395245,10.676949786395245,15.937074691070935,26.614024477466181,null,null,null,null,5,3.5643263980168163,15,23.564326398016817,null,243,0,{"$f":"SUM(P$10:P252)/O252","v":0.63786008230452673},3.0496980794493638]
[8.0747401433594135,18.434344245034318,8.0747401433594135,15.22463294019027,23.299373083549682,null,null,null,null,5,2.921261241557338,15,22.921261241557339,null,244,0,{"$f":"SUM(P$10:P253)/O253","v":0.63524590163934425},0.37811184199234305]
[8.5103263197198693,9.578566834630184,8.5103263197198693,13.623628438958479,22.13395475867835,null,null,null,null,5,3.5247481860030963,15,23.524748186003094,null,245,1,{"$f":"SUM(P$10:P254)/O254","v":0.63673469387755099},-1.3907934273247449]
[11.767151630107387,11.903336048747628,11.767151630107387,17.01002685430646,28.777178484413845,null,null,null,null,5,0.46502614886178295,15,20.465026148861782,null,246,0,{"$f":"SUM(P$10:P255)/O255","v":0.63414634146341464},8.3121523355520637]
[14.246226079438735,16.787100877890623,14.246226079438735,14.090180070985294,28.336406150424029,null,null,null,null,5,2.8054119076623047,15,22.805411907662304,null,247,0,{"$f":"SUM(P$10:P256)/O256","v":0.63157894736842102},5.5309942427617251]
[2.3375272274524672,5.6631057035498706,2.3375272274524672,12.162284698236967,14.499811925689434,null,null,null,null,5,2.7502334039226701,15,22.750233403922671,null,248,1,{"$f":"SUM(P$10:P257)/O257","v":0.63306451612903225},-8.2504214782332372]
[13.538186148536832,15.566012572504732,13.538186148536832,17.408524581213136,30.946710729749967,null,null,null,null,5,4.3984033007480203,15,24.398403300748022,null,249,0,{"$f":"SUM(P$10:P258)/O258","v":0.63052208835341361},6.5483074290019445]
[5.7972264895270298,3.4726300666868126,3.4726300666868126,16.206718573030454,19.679348639717265,null,null,null,null,5,4.7115289420515785,15,24.711528942051579,null,250,1,{"$f":"SUM(P$10:P259)/O259","v":0.63200000000000001},-5.0321803023343143]
[0.48672591680741784,14.508778393493015,0.48672591680741784,12.442398186115053,12.92912410292247,null,null,null,null,5,0.9781221823871189,15,20.978122182387118,null,251,1,{"$f":"SUM(P$10:P260)/O260","v":0.63346613545816732},-8.0489980794646474]
[4.0968122962966298,10.46007580046307,4.0968122962966298,16.282214177270497,20.379026473567126,null,null,null,null,5,0.45349109789503572,15,20.453491097895036,null,252,1,{"$f":"SUM(P$10:P261)/O261","v":0.63492063492063489},-7.4464624327909235E-2]
[1.6837190783523015,10.273299978414306,1.6837190783523015,15.255520957108683,16.939240035460983,null,null,null,null,5,0.13695991942140995,15,20.136959919421408,null,253,1,{"$f":"SUM(P$10:P262)/O262","v":0.63636363636363635},-3.1977198839604242]
[7.1782028324750886,0.94328185537764009,0.94328185537764009,12.45954702892687,13.40282888430451,null,null,null,null,5,2.9482741405316237,15,22.948274140531623,null,254,1,{"$f":"SUM(P$10:P263)/O263","v":0.63779527559055116},-9.5454452562271133]
[4.6697128910152781,5.5921765956027443,4.6697128910152781,15.130675051925932,19.80038794294121,null,null,null,null,5,4.9731617620420643,15,24.973161762042064,null,255,1,{"$f":"SUM(P$10:P264)/O264","v":0.63921568627450975},-5.1727738191008541]
[19.797846511231779,17.3561263830216,17.3561263830216,14.971909862973256,32.328036245994852,null,null,null,null,5,4.8704548583375198,15,24.870454858337521,null,256,0,{"$f":"SUM(P$10:P265)/O265","v":0.63671875},7.4575813876573314]
[6.7182165859009091,10.765121005720442,{"$f":"MIN(A266:B266)","v":6.7182165859009091},{"$f":"D$7+RAND()*D$8","v":15.725336440172448},{"$f":"D266+C266","v":22.443553026073356},null,null,null,null,5,{"$f":"K$7+RAND()*K$8","v":3.7301658587492681},15,{"$f":"L266+K266+J266","v":23.730165858749267},null,257,{"$f":"(E266<M266)*1","v":1},{"$f":"SUM(P$10:P266)/O266","v":0.63813229571984431},{"$f":"E266-M266","v":-1.2866128326759103}]
[6.7279399094634602,13.641253258881505,6.7279399094634602,17.135514288911601,23.863454198375059,null,null,null,null,5,2.1785584857124682,15,22.178558485712468,null,{"$f":"O266+1","v":258},0,{"$f":"SUM(P$10:P267)/O267","v":0.63565891472868219},1.6848957126625912]
[8.3665925400787504,10.892622429254038,8.3665925400787504,13.089323793387875,21.455916333466625,null,null,null,null,5,1.033220905031742,15,21.03322090503174,null,259,0,{"$f":"SUM(P$10:P268)/O268","v":0.63320463320463316},0.42269542843488495]
[10.614482141367578,8.6572639916800558,8.6572639916800558,13.615923921548422,22.273187913228476,null,null,null,null,5,3.3225692676119367,15,23.322569267611936,null,260,1,{"$f":"SUM(P$10:P269)/O269","v":0.63461538461538458},-1.0493813543834598]
[{"$f":"A$7+RAND()*A$8","v":19.133455051296778},7.5762809288436479,7.5762809288436479,14.524873167302264,22.101154096145912,null,null,null,null,5,1.6013776621034326,15,21.601377662103431,null,261,0,{"$f":"SUM(P$10:P270)/O270","v":0.63218390804597702},0.49977643404248084]
[4.318424255888913,8.0065446701631089,4.318424255888913,12.786313654443124,17.104737910332037,null,null,null,null,5,0.33239985660639126,15,20.332399856606393,null,262,1,{"$f":"SUM(P$10:P271)/O271","v":0.63358778625954193},-3.2276619462743561]
[5.7129915839382939,18.135699684421493,5.7129915839382939,16.954258188617612,22.667249772555905,null,null,null,null,5,1.3462098314208131,15,21.346209831420815,null,263,0,{"$f":"SUM(P$10:P272)/O272","v":0.63117870722433456},1.3210399411350906]
[6.1991128868594725,5.2744426478063282,5.2744426478063282,13.695277783298868,18.969720431105195,null,null,null,null,5,0.91056181516314449,15,20.910561815163145,null,264,1,{"$f":"SUM(P$10:P273)/O273","v":0.63257575757575757},-1.9408413840579506]
[16.67823796785957,15.748896850479216,15.748896850479216,13.127351394305679,28.876248244784897,null,null,null,null,5,0.3500197388062648,15,20.350019738806267,null,265,0,{"$f":"SUM(P$10:P274)/O274","v":0.63018867924528299},8.5262285059786294]
[0.98166712887818308,9.1477457145269963,0.98166712887818308,14.76334285950583,15.745009988384012,null,null,null,null,5,2.7121557454491931,15,22.712155745449195,null,266,1,{"$f":"SUM(P$10:P275)/O275","v":0.63157894736842102},-6.9671457570651825]
[8.7923360328546174,10.462750226105415,8.7923360328546174,15.592323393111997,24.384659425966614,null,null,null,null,5,0.76761552122792343,15,20.767615521227924,null,267,0,{"$f":"SUM(P$10:P276)/O276","v":0.6292134831460674},3.61704390473869]
[16.290662889151978,6.1791607520254699,6.1791607520254699,15.93872732006496,22.11788807209043,null,null,null,null,5,2.2520920010728713,15,22.252092001072871,null,268,1,{"$f":"SUM(P$10:P277)/O277","v":0.63059701492537312},-0.1342039289824406]
[15.114671436959084,2.5289884767561577,2.5289884767561577,13.676193285849092,16.20518176260525,null,null,null,null,5,1.3114819301078713,15,21.31148193010787,null,269,1,{"$f":"SUM(P$10:P278)/O278","v":0.63197026022304836},-5.1063001675026207]
[0.27936202559416312,3.3250106257899081,0.27936202559416312,12.581072489703958,12.86043451529812,null,null,null,null,5,4.0755376623866439,15,24.075537662386644,null,270,1,{"$f":"SUM(P$10:P279)/O279","v":0.6333333333333333},-11.215103147088524]
[18.270248509029585,11.032334240447019,11.032334240447019,14.356158436609956,25.388492677056973,null,null,null,null,5,3.6125857191676118,15,23.612585719167612,null,271,0,{"$f":"SUM(P$10:P280)/O280","v":0.63099630996309963},1.7759069578893616]
[9.4117908417986857,18.710840352269742,9.4117908417986857,14.741230537350521,24.153021379149209,null,null,null,null,5,3.1553914155654672,15,23.155391415565468,null,272,0,{"$f":"SUM(P$10:P281)/O281","v":0.62867647058823528},0.99762996358374068]
[12.990041403923968,3.689562639105648,3.689562639105648,12.963331348290959,16.652893987396606,null,null,null,null,5,0.83326408150108611,15,20.833264081501085,null,273,1,{"$f":"SUM(P$10:P282)/O282","v":0.63003663003663002},-4.1803700941044788]
[17.095500426372826,15.90002723003759,15.90002723003759,17.875101993138195,33.775129223175782,null,null,null,null,5,1.6387093201024305,15,21.638709320102432,null,274,0,{"$f":"SUM(P$10:P283)/O283","v":0.62773722627737227},12.13641990307335]
[11.436190891423506,13.166411952778844,11.436190891423506,14.025691643524798,25.461882534948302,null,null,null,null,5,2.949791274281814,15,22.949791274281814,null,275,0,{"$f":"SUM(P$10:P284)/O284","v":0.62545454545454549},2.5120912606664874]
[0.89999448127854542,12.345622535947598,0.89999448127854542,14.817295025275758,15.717289506554303,null,null,null,null,5,1.6359798577141453,15,21.635979857714144,null,276,1,{"$f":"SUM(P$10:P285)/O285","v":0.62681159420289856},-5.9186903511598405]
[4.7577539362103405,12.254202329347239,4.7577539362103405,15.345907209593687,20.103661145804026,null,null,null,null,5,2.0806316646717971,15,22.080631664671799,null,277,1,{"$f":"SUM(P$10:P286)/O286","v":0.62815884476534301},-1.9769705188677733]
[11.293676886322249,12.099175192399725,11.293676886322249,16.306031339670056,27.599708225992305,null,null,null,null,5,4.5503750477379459,15,24.550375047737944,null,278,0,{"$f":"SUM(P$10:P287)/O287","v":0.62589928057553956},3.0493331782543613]
[1.6879697944551264,12.88447297545382,1.6879697944551264,14.115852922120393,15.803822716575519,null,null,null,null,5,0.50035099298495644,15,20.500350992984956,null,279,1,{"$f":"SUM(P$10:P288)/O288","v":0.62724014336917566},-4.6965282764094365]
[7.5491839600606596,1.7007563613477417,1.7007563613477417,14.305279470505049,16.006035831852792,null,null,null,null,5,1.9017606236214357,15,21.901760623621435,null,280,1,{"$f":"SUM(P$10:P289)/O289","v":0.62857142857142856},-5.8957247917686431]
[{"$f":"A$7+RAND()*A$8","v":19.798905112156646},10.555835651718821,10.555835651718821,13.121230255585461,23.677065907304282,null,null,null,null,5,2.0520403235348579,15,22.052040323534857,null,281,0,{"$f":"SUM(P$10:P290)/O290","v":0.62633451957295372},1.6250255837694247]
[13.106851534766355,2.1042365634249971,2.1042365634249971,16.252913089999929,18.357149653424926,null,null,null,null,5,2.5480348919675713,15,22.548034891967571,null,282,1,{"$f":"SUM(P$10:P291)/O291","v":0.62765957446808507},-4.1908852385426449]
[11.991123270798932,11.641893691642666,11.641893691642666,14.225320171505608,25.867213863148272,null,null,null,null,5,4.145973000473151,15,24.145973000473152,null,283,0,{"$f":"SUM(P$10:P292)/O292","v":0.62544169611307421},1.7212408626751206]
[5.8275079699524079,9.8084019615656448,5.8275079699524079,16.588598826606102,22.416106796558509,null,null,null,null,5,3.387095396968026,15,23.387095396968025,null,284,1,{"$f":"SUM(P$10:P293)/O293","v":0.62676056338028174},-0.97098860040951607]
[19.32622067090908,2.2944064951057319,2.2944064951057319,14.663380731107623,16.957787226213355,null,null,null,null,5,0.99233280386119727,15,20.992332803861196,null,285,1,{"$f":"SUM(P$10:P294)/O294","v":0.62807017543859645},-4.0345455776478403]
[14.566261032726652,2.8770744730640518,2.8770744730640518,15.807024350050369,18.684098823114422,null,null,null,null,5,4.848508082316016,15,24.848508082316016,null,286,1,{"$f":"SUM(P$10:P295)/O295","v":0.62937062937062938},-6.1644092592015944]
[16.197959260609359,12.087141841929029,12.087141841929029,14.242247400461704,26.329389242390732,null,null,null,null,5,2.8969417476062835,15,22.896941747606284,null,287,0,{"$f":"SUM(P$10:P296)/O296","v":0.62717770034843201},3.4324474947844479]
[14.168974961501483,14.220488212815459,14.168974961501483,16.355573235404599,30.524548196906082,null,null,null,null,5,3.1090568896346427,15,23.109056889634644,null,288,0,{"$f":"SUM(P$10:P297)/O297","v":0.625},7.4154913072714379]
[17.35933358452424,0.46677670991963849,0.46677670991963849,15.959228822865171,16.42600553278481,null,null,null,null,5,1.8930517541132341,15,21.893051754113234,null,289,1,{"$f":"SUM(P$10:P298)/O298","v":0.62629757785467133},-5.4670462213284239]
[7.351996243893768,0.69565821830157359,0.69565821830157359,13.314621640596632,14.010279858898206,null,null,null,null,5,3.0937227877703672,15,23.093722787770368,null,290,1,{"$f":"SUM(P$10:P299)/O299","v":0.62758620689655176},-9.0834429288721612]
[12.549447786932353,16.448781860391112,12.549447786932353,13.830773660687335,26.380221447619689,null,null,null,null,5,3.8703466492978262,15,23.870346649297826,null,291,0,{"$f":"SUM(P$10:P300)/O300","v":0.62542955326460481},2.5098747983218637]
[10.483725665881112,9.2527907817322088,9.2527907817322088,15.786888584240211,25.039679365972418,null,null,null,null,5,3.3726253482825186,15,23.372625348282519,null,292,0,{"$f":"SUM(P$10:P301)/O301","v":0.62328767123287676},1.6670540176898996]
[12.526697104304947,9.519140060809816,9.519140060809816,12.357420662257038,21.876560723066852,null,null,null,null,5,0.12816248401280095,15,20.128162484012801,null,293,0,{"$f":"SUM(P$10:P302)/O302","v":0.62116040955631402},1.7483982390540511]
[13.51589134432851,13.034612033693236,13.034612033693236,17.961950736412597,30.996562770105832,null,null,null,null,5,3.7522254052413229,15,23.752225405241322,null,294,0,{"$f":"SUM(P$10:P303)/O303","v":0.61904761904761907},7.24433736486451]
[4.0214513071219375,4.987526019384152,4.0214513071219375,12.682198241645828,16.703649548767764,null,null,null,null,5,3.5756987940179612,15,23.57569879401796,null,295,1,{"$f":"SUM(P$10:P304)/O304","v":0.62033898305084745},-6.8720492452501958]
[4.0709384733948379,3.9387025115772012,3.9387025115772012,13.989762422927518,17.928464934504717,null,null,null,null,5,2.2982896539334945,15,22.298289653933494,null,296,1,{"$f":"SUM(P$10:P305)/O305","v":0.6216216216216216},-4.3698247194287774]
[19.427783651759214,8.9725076896554263,8.9725076896554263,14.012079139772652,22.984586829428078,null,null,null,null,5,1.73196358399428,15,21.731963583994279,null,297,0,{"$f":"SUM(P$10:P306)/O306","v":0.61952861952861948},1.2526232454337993]
[19.280022253339357,13.728117437627139,13.728117437627139,17.225366316010223,30.953483753637364,null,null,null,null,5,0.30185455580410303,15,20.301854555804105,null,298,0,{"$f":"SUM(P$10:P307)/O307","v":0.6174496644295302},10.651629197833259]
[9.3456693630760146,18.277783610214769,9.3456693630760146,16.094091626489625,25.439760989565642,null,null,null,null,5,4.4644349620171315,15,24.46443496201713,null,299,0,{"$f":"SUM(P$10:P308)/O308","v":0.61538461538461542},0.97532602754851183]
[3.5680181826181867,11.646942425252771,3.5680181826181867,14.357359548174038,17.925377730792224,null,null,null,null,5,4.2317287907558789,15,24.231728790755881,null,300,1,{"$f":"SUM(P$10:P309)/O309","v":0.6166666666666667},-6.3063510599636565]
[{"$f":"A$7+RAND()*A$8","v":6.5024511288839619},11.198010270947162,6.5024511288839619,12.558596737711131,19.061047866595093,null,null,null,null,5,3.544896830803288,15,23.544896830803289,null,301,1,{"$f":"SUM(P$10:P310)/O310","v":0.61794019933554822},-4.483848964208196]
[14.14969464092043,8.2531540894362525,8.2531540894362525,12.991122191162443,21.244276280598697,null,null,null,null,5,0.52095469413938111,15,20.52095469413938,null,302,0,{"$f":"SUM(P$10:P311)/O311","v":0.61589403973509937},0.72332158645931699]
[17.966275621978511,7.4745713800196123,7.4745713800196123,15.211875699537764,22.686447079557375,null,null,null,null,5,1.0154615850646886,15,21.015461585064688,null,303,0,{"$f":"SUM(P$10:P312)/O312","v":0.61386138613861385},1.6709854944926867]
[10.742189510128428,17.749906707175956,10.742189510128428,16.876398172113646,27.618587682242072,null,null,null,null,5,3.7808002261689189,15,23.780800226168918,null,304,0,{"$f":"SUM(P$10:P313)/O313","v":0.61184210526315785},3.8377874560731549]
[5.2370536706952127,5.5935958684475047,5.2370536706952127,17.666603150754931,22.903656821450141,null,null,null,null,5,3.5060563302887084,15,23.506056330288708,null,305,1,{"$f":"SUM(P$10:P314)/O314","v":0.61311475409836069},-0.60239950883856608]
[15.598550273285305,4.2336823621373192,4.2336823621373192,17.062015218019667,21.295697580156986,null,null,null,null,5,7.071681847517497E-3,15,20.007071681847517,null,306,0,{"$f":"SUM(P$10:P315)/O315","v":0.61111111111111116},1.2886258983094692]
[8.6045973765715473,5.3166212306566578,5.3166212306566578,13.631682697053311,18.948303927709969,null,null,null,null,5,2.6758084409628546,15,22.675808440962854,null,307,1,{"$f":"SUM(P$10:P316)/O316","v":0.6123778501628665},-3.7275045132528852]
[5.0745945586161429,7.6307194201615847,5.0745945586161429,12.175420155284309,17.250014713900452,null,null,null,null,5,4.7137355992976699,15,24.713735599297671,null,308,1,{"$f":"SUM(P$10:P317)/O317","v":0.61363636363636365},-7.463720885397219]
[13.979512501724694,18.240582559079414,13.979512501724694,12.010939550697458,25.99045205242215,null,null,null,null,5,1.1765934535345428,15,21.176593453534544,null,309,0,{"$f":"SUM(P$10:P318)/O318","v":0.61165048543689315},4.8138585988876059]
[4.531719491555803,17.828248525023497,4.531719491555803,12.61306782246721,17.144787314023013,null,null,null,null,5,1.883624833523766,15,21.883624833523765,null,310,1,{"$f":"SUM(P$10:P319)/O319","v":0.61290322580645162},-4.7388375195007519]
[16.483456996374706,9.2058820843202334,9.2058820843202334,16.791311416653837,25.99719350097407,null,null,null,null,5,9.3787521881379399E-2,15,20.093787521881382,null,311,0,{"$f":"SUM(P$10:P320)/O320","v":0.61093247588424437},5.9034059790926889]
[19.72680567508381,14.908062313270925,14.908062313270925,17.992224569615828,32.900286882886753,null,null,null,null,5,3.8600353757149426,15,23.860035375714943,null,312,0,{"$f":"SUM(P$10:P321)/O321","v":0.60897435897435892},9.0402515071718099]
[2.8535324028480646,3.7838816812082565,2.8535324028480646,12.706549631184945,15.560082034033009,null,null,null,null,5,1.6043810647528804,15,21.604381064752879,null,313,1,{"$f":"SUM(P$10:P322)/O322","v":0.61022364217252401},-6.0442990307198698]
[3.153799465777225,19.367765288488489,3.153799465777225,13.535050187350173,16.688849653127399,null,null,null,null,5,3.84260278535805,15,23.84260278535805,null,314,1,{"$f":"SUM(P$10:P323)/O323","v":0.61146496815286622},-7.1537531322306513]
[6.2285101230250088,0.78923757659722815,0.78923757659722815,13.010824086479035,13.800061663076264,null,null,null,null,5,4.3461168465502391,15,24.346116846550238,null,315,1,{"$f":"SUM(P$10:P324)/O324","v":0.61269841269841274},-10.546055183473975]
[11.581428642291069,1.3192473122137027,1.3192473122137027,12.712810282056159,14.032057594269862,null,null,null,null,5,0.96913360187874498,15,20.969133601878745,null,316,1,{"$f":"SUM(P$10:P325)/O325","v":0.61392405063291144},-6.9370760076088835]
[14.7794569420522,12.975426216420075,12.975426216420075,13.440771235051091,26.416197451471167,null,null,null,null,5,2.3690380224853635,15,22.369038022485363,null,317,0,{"$f":"SUM(P$10:P326)/O326","v":0.61198738170347},4.0471594289858039]
[10.054465907719072,5.98767220599062,5.98767220599062,12.769212506963937,18.756884712954559,null,null,null,null,5,2.9378203928045252,15,22.937820392804525,null,318,1,{"$f":"SUM(P$10:P327)/O327","v":0.6132075471698113},-4.1809356798499664]
[17.317359081841747,2.7626679858069125,2.7626679858069125,16.361253749098871,19.123921734905785,null,null,null,null,5,3.6552743071831637,15,23.655274307183163,null,319,1,{"$f":"SUM(P$10:P328)/O328","v":0.61442006269592475},-4.5313525722773775]
[1.9953849467157436,18.583853417392447,1.9953849467157436,13.000139175739648,14.995524122455391,null,null,null,null,5,2.4208199432894766,15,22.420819943289477,null,320,1,{"$f":"SUM(P$10:P329)/O329","v":0.61562499999999998},-7.4252958208340853]
[{"$f":"A$7+RAND()*A$8","v":4.7233632398862069},14.421918088999362,{"$f":"MIN(A330:B330)","v":4.7233632398862069},{"$f":"D$7+RAND()*D$8","v":12.254250177657642},{"$f":"D330+C330","v":16.97761341754385},null,null,null,null,5,{"$f":"K$7+RAND()*K$8","v":2.7611824456233212},15,{"$f":"L330+K330+J330","v":22.761182445623319},null,321,{"$f":"(E330<M330)*1","v":1},{"$f":"SUM(P$10:P330)/O330","v":0.61682242990654201},{"$f":"E330-M330","v":-5.7835690280794694}]
[10.589161910823847,1.7443396387169052,1.7443396387169052,16.305117754616496,18.049457393333402,null,null,null,null,5,1.8998325953498769,15,21.899832595349878,null,{"$f":"O330+1","v":322},1,{"$f":"SUM(P$10:P331)/O331","v":0.61801242236024845},-3.8503752020164761]
[16.515367576653595,13.726348679511704,13.726348679511704,14.444490753676973,28.170839433188675,null,null,null,null,5,0.33267359792193307,15,20.332673597921932,null,323,0,{"$f":"SUM(P$10:P332)/O332","v":0.61609907120743035},7.8381658352667429]
[7.9745364612122671,7.673709283023527,7.673709283023527,15.967898850557784,23.641608133581311,null,null,null,null,5,3.5089508175395694,15,23.508950817539571,null,324,0,{"$f":"SUM(P$10:P333)/O333","v":0.61419753086419748},0.13265731604174036]
[2.6211676321761246E-2,1.0479884090684166,2.6211676321761246E-2,12.599596210554292,12.625807886876053,null,null,null,null,5,2.2824339048890496,15,22.28243390488905,null,325,1,{"$f":"SUM(P$10:P334)/O334","v":0.61538461538461542},-9.6566260180129966]
[3.754174164060009,17.368360379539443,3.754174164060009,14.612436039377087,18.366610203437098,null,null,null,null,5,2.9650864828171706,15,22.965086482817171,null,326,1,{"$f":"SUM(P$10:P335)/O335","v":0.6165644171779141},-4.5984762793800726]
[15.785540334530538,7.1696882595996181,7.1696882595996181,12.314585566874293,19.48427382647391,null,null,null,null,5,0.35982836858784117,15,20.359828368587841,null,327,1,{"$f":"SUM(P$10:P336)/O336","v":0.61773700305810397},-0.87555454211393169]
[13.823648453251005,10.862469045129137,10.862469045129137,14.397781901404143,25.260250946533279,null,null,null,null,5,2.8196239751867709,15,22.819623975186772,null,328,0,{"$f":"SUM(P$10:P337)/O337","v":0.61585365853658536},2.4406269713465072]
[10.854298356432334,14.97239688570733,10.854298356432334,17.530543812103485,28.384842168535819,null,null,null,null,5,4.309038806276722,15,24.309038806276721,null,329,0,{"$f":"SUM(P$10:P338)/O338","v":0.61398176291793316},4.0758033622590979]
[10.344983392706727,18.574077768125978,10.344983392706727,14.592036536919732,24.937019929626459,null,null,null,null,5,0.59045364177740034,15,20.590453641777401,null,330,0,{"$f":"SUM(P$10:P339)/O339","v":0.61212121212121207},4.3465662878490576]
[3.8427491774201661,17.722526246944781,3.8427491774201661,12.919738709615221,16.762487887035388,null,null,null,null,5,2.225197982976614,15,22.225197982976614,null,331,1,{"$f":"SUM(P$10:P340)/O340","v":0.61329305135951662},-5.462710095941226]
[15.705232328868044,14.886378029528366,14.886378029528366,14.249168519304774,29.13554654883314,null,null,null,null,5,1.7140808437200077,15,21.714080843720009,null,332,0,{"$f":"SUM(P$10:P341)/O341","v":0.61144578313253017},7.4214657051131319]
[13.008997179255514,13.238781832209952,13.008997179255514,12.425882665459977,25.434879844715489,null,null,null,null,5,4.7411456032438455,15,24.741145603243844,null,333,0,{"$f":"SUM(P$10:P342)/O342","v":0.60960960960960964},0.69373424147164542]
[18.114251499017683,2.6540253909076439,2.6540253909076439,16.072173322627382,18.726198713535027,null,null,null,null,5,0.63742522417553682,15,20.637425224175537,null,334,1,{"$f":"SUM(P$10:P343)/O343","v":0.6107784431137725},-1.9112265106405104]
[16.104455765135512,16.467305840589312,16.104455765135512,13.042763946896232,29.147219712031742,null,null,null,null,5,3.4488107228968605,15,23.448810722896859,null,335,0,{"$f":"SUM(P$10:P344)/O344","v":0.60895522388059697},5.698408989134883]
[19.264419979177262,19.042284253481146,19.042284253481146,12.246631886665103,31.288916140146249,null,null,null,null,5,4.143309182341298,15,24.143309182341298,null,336,0,{"$f":"SUM(P$10:P345)/O345","v":0.6071428571428571},7.1456069578049508]
[18.105406891691704,10.900131402205274,10.900131402205274,15.07196261312113,25.972094015326405,null,null,null,null,5,0.47483612794126995,15,20.47483612794127,null,337,0,{"$f":"SUM(P$10:P346)/O346","v":0.60534124629080122},5.4972578873851354]
[3.1153234325671986,3.3436325909776676,3.1153234325671986,17.105412424993109,20.220735857560307,null,null,null,null,5,0.60345127778741847,15,20.603451277787418,null,338,1,{"$f":"SUM(P$10:P347)/O347","v":0.60650887573964496},-0.38271542022711103]
[5.9448174518841164,18.257687081372453,5.9448174518841164,14.223258795160817,20.168076247044933,null,null,null,null,5,3.0768288036744456,15,23.076828803674445,null,339,1,{"$f":"SUM(P$10:P348)/O348","v":0.60766961651917406},-2.908752556629512]
[8.7674989377053354,10.180063402565718,8.7674989377053354,12.293788849986141,21.061287787691477,null,null,null,null,5,1.0253144211366172,15,21.025314421136617,null,340,0,{"$f":"SUM(P$10:P349)/O349","v":0.60588235294117643},3.5973366554859609E-2]
[{"$f":"A$7+RAND()*A$8","v":3.0924676331375167},18.826176197099361,3.0924676331375167,16.791444463594118,19.883912096731635,null,null,null,null,5,1.7219533607586217,15,21.721953360758622,null,341,1,{"$f":"SUM(P$10:P350)/O350","v":0.60703812316715544},-1.8380412640269874]
[16.742153076846023,5.4232187397183607,5.4232187397183607,13.63510108421054,19.058319823928901,null,null,null,null,5,0.9834317467071052,15,20.983431746707105,null,342,1,{"$f":"SUM(P$10:P351)/O351","v":0.60818713450292394},-1.9251119227782034]
[2.5516887964860313,19.52415395312056,2.5516887964860313,14.354899724447113,16.906588520933145,null,null,null,null,5,2.6025910216616404,15,22.602591021661642,null,343,1,{"$f":"SUM(P$10:P352)/O352","v":0.60932944606413997},-5.6960025007284969]
[18.397353017303871,9.4379496084700811,9.4379496084700811,17.940487818139701,27.378437426609782,null,null,null,null,5,4.4807504197350507,15,24.480750419735053,null,344,0,{"$f":"SUM(P$10:P353)/O353","v":0.60755813953488369},2.8976870068747296]
[13.566826654254919,17.86808608736419,13.566826654254919,13.79423549012942,27.361062144384341,null,null,null,null,5,1.5018917282938244,15,21.501891728293824,null,345,0,{"$f":"SUM(P$10:P354)/O354","v":0.60579710144927534},5.8591704160905174]
[16.642938471278509,8.7519326109847171,8.7519326109847171,14.82511957092683,23.577052181911547,null,null,null,null,5,3.2277093771847651,15,23.227709377184766,null,346,0,{"$f":"SUM(P$10:P355)/O355","v":0.60404624277456642},0.34934280472678125]
[4.5939997492428164,2.2564583560006346,2.2564583560006346,16.766827113566936,19.023285469567572,null,null,null,null,5,4.7094064011116235,15,24.709406401111622,null,347,1,{"$f":"SUM(P$10:P356)/O356","v":0.60518731988472618},-5.6861209315440497]
[18.545113736894148,16.618795872972452,16.618795872972452,14.291470261455332,30.910266134427786,null,null,null,null,5,0.69771668947947452,15,20.697716689479474,null,348,0,{"$f":"SUM(P$10:P357)/O357","v":0.60344827586206895},10.212549444948312]
[15.533555678953331,14.228132608080719,14.228132608080719,13.41865776008316,27.646790368163877,null,null,null,null,5,1.4470840387834638E-2,15,20.014470840387837,null,349,0,{"$f":"SUM(P$10:P358)/O358","v":0.60171919770773641},7.6323195277760405]
[17.589486922126909,4.1055895709734731,4.1055895709734731,13.600078914338784,17.705668485312259,null,null,null,null,5,0.53274429518302413,15,20.532744295183022,null,350,1,{"$f":"SUM(P$10:P359)/O359","v":0.60285714285714287},-2.8270758098707631]
[14.796572415747759,13.985802685345742,13.985802685345742,15.676397417202477,29.662200102548219,null,null,null,null,5,3.5563275764583064,15,23.556327576458308,null,351,0,{"$f":"SUM(P$10:P360)/O360","v":0.60113960113960119},6.1058725260899109]
[8.9590172057891735,14.208617477533226,8.9590172057891735,13.251444174558376,22.210461380347549,null,null,null,null,5,0.85824273241993376,15,20.858242732419932,null,352,0,{"$f":"SUM(P$10:P361)/O361","v":0.59943181818181823},1.3522186479276179]
[7.9631344540139626,3.4745290573935761,3.4745290573935761,17.520888163979947,20.995417221373522,null,null,null,null,5,0.14742929629627588,15,20.147429296296274,null,353,0,{"$f":"SUM(P$10:P362)/O362","v":0.59773371104815864},0.84798792507724841]
[0.11384874262698297,17.29137030509548,0.11384874262698297,12.181955139260911,12.295803881887894,null,null,null,null,5,4.166727737125596,15,24.166727737125598,null,354,1,{"$f":"SUM(P$10:P363)/O363","v":0.59887005649717517},-11.870923855237704]
[10.604485727316273,9.4924444022162984,9.4924444022162984,15.135845401017342,24.628289803233642,null,null,null,null,5,3.3853329246768125,15,23.385332924676813,null,355,0,{"$f":"SUM(P$10:P364)/O364","v":0.59718309859154928},1.2429568785568286]
[10.584647713287188,19.145632838602982,10.584647713287188,17.352953803647615,27.937601516934805,null,null,null,null,5,0.54882166954051348,15,20.548821669540516,null,356,0,{"$f":"SUM(P$10:P365)/O365","v":0.5955056179775281},7.3887798473942894]
[7.1452598880155556,17.046538952646497,7.1452598880155556,15.711604242737264,22.856864130752818,null,null,null,null,5,2.5642353212987774,15,22.564235321298778,null,357,0,{"$f":"SUM(P$10:P366)/O366","v":0.5938375350140056},0.29262880945404035]
[19.08650160751229,9.1863656784156547,9.1863656784156547,15.569619303668157,24.75598498208381,null,null,null,null,5,3.0095375640258397,15,23.009537564025841,null,358,0,{"$f":"SUM(P$10:P367)/O367","v":0.59217877094972071},1.7464474180579685]
[3.7478568191236894,19.982272118863008,3.7478568191236894,13.689920265287595,17.437777084411284,null,null,null,null,5,3.4332429345700484,15,23.43324293457005,null,359,1,{"$f":"SUM(P$10:P368)/O368","v":0.59331476323119781},-5.9954658501587659]
[17.060995993211641,18.832940139947809,17.060995993211641,15.019712570256496,32.080708563468136,null,null,null,null,5,2.2429723718123062,15,22.242972371812307,null,360,0,{"$f":"SUM(P$10:P369)/O369","v":0.59166666666666667},9.8377361916558286]
[{"$f":"A$7+RAND()*A$8","v":2.1139005476203754},14.642660596407964,2.1139005476203754,17.34534973202561,19.459250279645985,null,null,null,null,5,0.71646897920577546,15,20.716468979205775,null,361,1,{"$f":"SUM(P$10:P370)/O370","v":0.59279778393351801},-1.2572186995597896]
[12.178557995068706,11.406803458807218,11.406803458807218,15.777747379000047,27.184550837807265,null,null,null,null,5,4.4487495598601718,15,24.448749559860172,null,362,0,{"$f":"SUM(P$10:P371)/O371","v":0.59116022099447518},2.7358012779470933]
[0.14225329922231689,6.51937378315119,0.14225329922231689,13.792271752196758,13.934525051419074,null,null,null,null,5,1.8143762396228014,15,21.814376239622803,null,363,1,{"$f":"SUM(P$10:P372)/O372","v":0.59228650137741046},-7.8798511882037285]
[7.61902346683621,13.360356589653186,7.61902346683621,16.033153213838723,23.652176680674934,null,null,null,null,5,1.9740615594191213,15,21.97406155941912,null,364,0,{"$f":"SUM(P$10:P373)/O373","v":0.59065934065934067},1.6781151212558143]
[7.7660836469516674,3.6678810362161007,3.6678810362161007,15.671004773245034,19.338885809461136,null,null,null,null,5,3.8595880745390225,15,23.859588074539023,null,365,1,{"$f":"SUM(P$10:P374)/O374","v":0.59178082191780823},-4.5207022650778868]
[18.194827738683021,7.9394685947299131,7.9394685947299131,13.797972541549747,21.73744113627966,null,null,null,null,5,1.3739488067185963,15,21.373948806718595,null,366,0,{"$f":"SUM(P$10:P375)/O375","v":0.5901639344262295},0.36349232956106547]
[16.029946039411428,2.9311978319773035,2.9311978319773035,15.961184239184817,18.892382071162121,null,null,null,null,5,4.7061519495688833,15,24.706151949568884,null,367,1,{"$f":"SUM(P$10:P376)/O376","v":0.59128065395095364},-5.8137698784067631]
[17.83914485173781,1.5520974817681199,1.5520974817681199,13.890406441368004,15.442503923136124,null,null,null,null,5,1.7140944293195854,15,21.714094429319587,null,368,1,{"$f":"SUM(P$10:P377)/O377","v":0.59239130434782605},-6.2715905061834629]
[11.386822767099414,11.181953267442921,11.181953267442921,16.399115435855968,27.581068703298889,null,null,null,null,5,2.9458111102808053,15,22.945811110280804,null,369,0,{"$f":"SUM(P$10:P378)/O378","v":0.59078590785907859},4.6352575930180855]
[19.948922259505594,8.1618320612462103E-2,8.1618320612462103E-2,17.660776470912197,17.74239479152466,null,null,null,null,5,3.3731644962338061,15,23.373164496233805,null,370,1,{"$f":"SUM(P$10:P379)/O379","v":0.59189189189189184},-5.6307697047091452]
[17.013368387228464,2.7741146268597738,2.7741146268597738,15.514327244937192,18.288441871796966,null,null,null,null,5,3.0106658768023431,15,23.010665876802342,null,371,1,{"$f":"SUM(P$10:P380)/O380","v":0.59299191374663074},-4.7222240050053763]
[6.8020914594096338,10.712797089693222,6.8020914594096338,13.101136753263184,19.903228212672818,null,null,null,null,5,2.7461475739234453,15,22.746147573923444,null,372,1,{"$f":"SUM(P$10:P381)/O381","v":0.59408602150537637},-2.8429193612506261]
[12.261269182898557,3.893732804435257,3.893732804435257,14.59832527963129,18.492058084066546,null,null,null,null,5,0.17214979087012916,15,20.172149790870129,null,373,1,{"$f":"SUM(P$10:P382)/O382","v":0.5951742627345844},-1.6800917068035837]
[13.066455368969779,12.061248775111466,12.061248775111466,15.218460864009684,27.279709639121151,null,null,null,null,5,1.3016160477760974,15,21.301616047776097,null,374,0,{"$f":"SUM(P$10:P383)/O383","v":0.5935828877005348},5.9780935913450541]
[17.744147873640117,4.7345762153990218,4.7345762153990218,16.347207237840124,21.081783453239147,null,null,null,null,5,4.2604781740806184,15,24.260478174080617,null,375,1,{"$f":"SUM(P$10:P384)/O384","v":0.59466666666666668},-3.1786947208414702]
[19.681652835977101,3.6527300160652554,3.6527300160652554,17.843149537546939,21.495879553612195,null,null,null,null,5,4.5627997780646705,15,24.562799778064672,null,376,1,{"$f":"SUM(P$10:P385)/O385","v":0.5957446808510638},-3.0669202244524776]
[14.424179592753246,9.5112510772969685,9.5112510772969685,15.346361102903957,24.857612180200924,null,null,null,null,5,0.29765508928956574,15,20.297655089289567,null,377,0,{"$f":"SUM(P$10:P386)/O386","v":0.59416445623342173},4.5599570909113574]
[2.197075957682435,6.9575751991035384,2.197075957682435,14.597982296288539,16.795058253970975,null,null,null,null,5,3.303447475328916,15,23.303447475328916,null,378,1,{"$f":"SUM(P$10:P387)/O387","v":0.59523809523809523},-6.5083892213579411]
[18.338849204852842,9.6696710029751962,9.6696710029751962,15.631945849374709,25.301616852349905,null,null,null,null,5,2.7092095975659349,15,22.709209597565934,null,379,0,{"$f":"SUM(P$10:P388)/O388","v":0.59366754617414252},2.5924072547839714]
[0.20987986520963453,0.69440642264047892,0.20987986520963453,13.008461380353745,13.21834124556338,null,null,null,null,5,4.4610021631280716,15,24.461002163128072,null,380,1,{"$f":"SUM(P$10:P389)/O389","v":0.59473684210526312},-11.242660917564692]
[{"$f":"A$7+RAND()*A$8","v":10.22005853148594},2.7824815206536746,2.7824815206536746,16.750786587453366,19.533268108107041,null,null,null,null,5,0.94946448916151394,15,20.949464489161514,null,381,1,{"$f":"SUM(P$10:P390)/O390","v":0.59580052493438318},-1.4161963810544727]
[9.4284631751270869,0.17769296053104844,0.17769296053104844,13.907718211863132,14.085411172394181,null,null,null,null,5,4.3657627626541444,15,24.365762762654143,null,382,1,{"$f":"SUM(P$10:P391)/O391","v":0.59685863874345546},-10.280351590259961]
[8.1834362101978382,12.420179382192767,8.1834362101978382,13.141238702826438,21.324674913024275,null,null,null,null,5,1.369408727784811,15,21.369408727784812,null,383,1,{"$f":"SUM(P$10:P392)/O392","v":0.59791122715404699},-4.4733814760537172E-2]
[15.988880466335884,10.783993373638165,10.783993373638165,16.221667663218248,27.005661036856413,null,null,null,null,5,3.0967321643644214,15,23.096732164364422,null,384,0,{"$f":"SUM(P$10:P393)/O393","v":0.59635416666666663},3.9089288724919911]
[16.187523732795277,5.2805560746651441,{"$f":"MIN(A394:B394)","v":5.2805560746651441},{"$f":"D$7+RAND()*D$8","v":16.174934820194856},{"$f":"D394+C394","v":21.455490894859999},null,null,null,null,5,{"$f":"K$7+RAND()*K$8","v":4.5699663071531358},15,{"$f":"L394+K394+J394","v":24.569966307153138},null,385,{"$f":"(E394<M394)*1","v":1},{"$f":"SUM(P$10:P394)/O394","v":0.59740259740259738},{"$f":"E394-M394","v":-3.1144754122931388}]
[14.212237727490189,16.340441969982781,14.212237727490189,15.774819475618441,29.98705720310863,null,null,null,null,5,0.11473121245447582,15,20.114731212454476,null,{"$f":"O394+1","v":386},0,{"$f":"SUM(P$10:P395)/O395","v":0.59585492227979275},9.8723259906541543]
[0.64571297508357661,5.7943574568147334,0.64571297508357661,14.053694493038099,14.699407468121676,null,null,null,null,5,0.9295646651280548,15,20.929564665128055,null,387,1,{"$f":"SUM(P$10:P396)/O396","v":0.5968992248062015},-6.2301571970063794]
[6.5227079790682581,8.2612382793964656,6.5227079790682581,13.892753367938152,20.41546134700641,null,null,null,null,5,3.5294526512512063,15,23.529452651251205,null,388,1,{"$f":"SUM(P$10:P397)/O397","v":0.59793814432989689},-3.1139913042447951]
[9.812435312067274,15.778710030886842,9.812435312067274,14.523249390629292,24.335684702696568,null,null,null,null,5,1.1494945382325428,15,21.149494538232542,null,389,0,{"$f":"SUM(P$10:P398)/O398","v":0.59640102827763497},3.1861901644640263]
[2.9349515353366917,2.4340092723209139,2.4340092723209139,14.582135974005332,17.016145246326246,null,null,null,null,5,1.8124168423431071,15,21.812416842343108,null,390,1,{"$f":"SUM(P$10:P399)/O399","v":0.59743589743589742},-4.7962715960168616]
[8.2144214164264469,16.635130357531565,8.2144214164264469,15.858802224948459,24.073223641374906,null,null,null,null,5,4.0729686850465034,15,24.072968685046504,null,391,0,{"$f":"SUM(P$10:P400)/O400","v":0.59590792838874684},2.5495632840133453E-4]
[3.7656976129393094,5.0290935737917568,3.7656976129393094,15.443920715872231,19.209618328811541,null,null,null,null,5,2.2487516347010916,15,22.24875163470109,null,392,1,{"$f":"SUM(P$10:P401)/O401","v":0.59693877551020413},-3.0391333058895498]
[12.682064992765396,4.0092060428434646,4.0092060428434646,17.087528506334305,21.096734549177768,null,null,null,null,5,3.7330842255330432,15,23.733084225533045,null,393,1,{"$f":"SUM(P$10:P402)/O402","v":0.59796437659033075},-2.6363496763552767]
[11.856999149141249,17.607818542815927,11.856999149141249,12.605097875321526,24.462097024462775,null,null,null,null,5,0.2549347052277523,15,20.254934705227754,null,394,0,{"$f":"SUM(P$10:P403)/O403","v":0.59644670050761417},4.2071623192350209]
[19.556650155797769,9.2396470869309599,9.2396470869309599,13.751249238883677,22.990896325814639,null,null,null,null,5,0.45980442390900489,15,20.459804423909006,null,395,0,{"$f":"SUM(P$10:P404)/O404","v":0.59493670886075944},2.5310919019056328]
[15.23178540247287,2.2144408696652418,2.2144408696652418,13.315653757749972,15.530094627415213,null,null,null,null,5,4.8848977246708634,15,24.884897724670864,null,396,1,{"$f":"SUM(P$10:P405)/O405","v":0.59595959595959591},-9.3548030972556511]
[2.1302582397266434,11.746547452019358,2.1302582397266434,17.30413386277263,19.434392102499274,null,null,null,null,5,3.6854428552150678,15,23.685442855215069,null,397,1,{"$f":"SUM(P$10:P406)/O406","v":0.59697732997481112},-4.2510507527157948]
[12.127046285142768,12.700438097706758,12.127046285142768,15.918029232914275,28.045075518057043,null,null,null,null,5,1.1269827174851166,15,21.126982717485117,null,398,0,{"$f":"SUM(P$10:P407)/O407","v":0.59547738693467334},6.9180928005719267]
[6.7977341850911666,8.7769322304207282,6.7977341850911666,13.066177922306114,19.86391210739728,null,null,null,null,5,4.595034563433865,15,24.595034563433863,null,399,1,{"$f":"SUM(P$10:P408)/O408","v":0.59649122807017541},-4.7311224560365837]
[9.267004646098334,10.739832963937213,9.267004646098334,13.587088191251743,22.854092837350077,null,null,null,null,5,3.8284470642597408,15,23.828447064259741,null,400,1,{"$f":"SUM(P$10:P409)/O409","v":0.59750000000000003},-0.97435422690966433]
[{"$f":"A$7+RAND()*A$8","v":10.657029152714024},10.410991961819711,10.410991961819711,15.591285162591291,26.002277124411002,null,null,null,null,5,1.0318576377808786,15,21.031857637780877,null,401,0,{"$f":"SUM(P$10:P410)/O410","v":0.5960099750623441},4.9704194866301243]
[19.482371617605907,3.0800656668261905,3.0800656668261905,14.315213444591635,17.395279111417825,null,null,null,null,5,0.38471458447647267,15,20.384714584476473,null,402,1,{"$f":"SUM(P$10:P411)/O411","v":0.59701492537313428},-2.9894354730586485]
[17.785037269730459,19.88675267272011,17.785037269730459,16.819695331865944,34.604732601596403,null,null,null,null,5,0.37309821762845641,15,20.373098217628456,null,403,0,{"$f":"SUM(P$10:P412)/O412","v":0.59553349875930517},14.231634383967947]
[13.517013499054935,6.0813830775184901,6.0813830775184901,14.249618557360222,20.33100163487871,null,null,null,null,5,0.28329279650026407,15,20.283292796500263,null,404,0,{"$f":"SUM(P$10:P413)/O413","v":0.59405940594059403},4.7708838378447638E-2]
[3.9817320568444003,15.99660082334562,3.9817320568444003,14.398929910562703,18.380661967407104,null,null,null,null,5,4.598299735733077,15,24.598299735733079,null,405,1,{"$f":"SUM(P$10:P414)/O414","v":0.59506172839506177},-6.2176377683259751]
[19.89205184861019,10.45890363837551,10.45890363837551,15.117424228660596,25.576327867036106,null,null,null,null,5,0.78953050637510791,15,20.789530506375108,null,406,0,{"$f":"SUM(P$10:P415)/O415","v":0.59359605911330049},4.7867973606609979]
[10.317448857091001,18.47491640108759,10.317448857091001,14.494240618223905,24.811689475314907,null,null,null,null,5,4.7913272477478479,15,24.791327247747848,null,407,0,{"$f":"SUM(P$10:P416)/O416","v":0.59213759213759209},2.0362227567058966E-2]
[8.2089977181517177,3.1289143984961765,3.1289143984961765,14.301022832651181,17.429937231147356,null,null,null,null,5,0.45419684892229528,15,20.454196848922294,null,408,1,{"$f":"SUM(P$10:P417)/O417","v":0.59313725490196079},-3.0242596177749377]
[9.1623049626228656,5.1450944911588525,5.1450944911588525,16.842015479336663,21.987109970495517,null,null,null,null,5,1.2261498276612937,15,21.226149827661295,null,409,0,{"$f":"SUM(P$10:P418)/O418","v":0.59168704156479213},0.76096014283422164]
[19.944487081380096,6.6323110259309814,6.6323110259309814,13.439646614463307,20.071957640394288,null,null,null,null,5,3.0022722745089645,15,23.002272274508965,null,410,1,{"$f":"SUM(P$10:P419)/O419","v":0.59268292682926826},-2.9303146341146764]
[3.4392567987488842,17.521969046127687,3.4392567987488842,12.279008491401358,15.718265290150242,null,null,null,null,5,2.7015463228141834,15,22.701546322814185,null,411,1,{"$f":"SUM(P$10:P420)/O420","v":0.59367396593673971},-6.9832810326639425]
[7.6164394588086477,16.950600854253093,7.6164394588086477,13.583907504225561,21.200346963034207,null,null,null,null,5,0.32171991582336523,15,20.321719915823365,null,412,0,{"$f":"SUM(P$10:P421)/O421","v":0.59223300970873782},0.87862704721084128]
[9.8779999778403837,12.459566939312571,9.8779999778403837,17.559207166300798,27.437207144141183,null,null,null,null,5,3.9752819029705928,15,23.975281902970593,null,413,0,{"$f":"SUM(P$10:P422)/O422","v":0.59079903147699753},3.4619252411705901]
[9.6459661105178895,2.3381172350025436,2.3381172350025436,15.475092169457021,17.813209404459563,null,null,null,null,5,3.4009955358070973,15,23.400995535807098,null,414,1,{"$f":"SUM(P$10:P423)/O423","v":0.59178743961352653},-5.587786131347535]
[15.487233852916871,0.52724059323012495,0.52724059323012495,15.481021239625177,16.0082618328553,null,null,null,null,5,4.5362416088861304,15,24.536241608886129,null,415,1,{"$f":"SUM(P$10:P424)/O424","v":0.59277108433734937},-8.5279797760308291]
[3.2369546738136101,5.752823968921696,3.2369546738136101,12.194198966528154,15.431153640341764,null,null,null,null,5,0.96374331971900706,15,20.963743319719008,null,416,1,{"$f":"SUM(P$10:P425)/O425","v":0.59375},-5.532589679377244]
[2.6759159070985516,19.253364935021064,2.6759159070985516,17.993985572974566,20.669901480073118,null,null,null,null,5,4.6732457170266439,15,24.673245717026646,null,417,1,{"$f":"SUM(P$10:P426)/O426","v":0.59472422062350117},-4.0033442369535273]
[8.9599544665545761,5.0547375371356251,5.0547375371356251,13.329820588389254,18.38455812552488,null,null,null,null,5,3.991668457064085,15,23.991668457064087,null,418,1,{"$f":"SUM(P$10:P427)/O427","v":0.59569377990430628},-5.6071103315392072]
[18.466843858146603,1.5684587847183828,1.5684587847183828,16.237354603196984,17.805813387915368,null,null,null,null,5,0.31456416647507257,15,20.314564166475073,null,419,1,{"$f":"SUM(P$10:P428)/O428","v":0.59665871121718372},-2.5087507785597047]
[16.046665484100785,6.4059410947791289,6.4059410947791289,17.15313318320894,23.559074277988067,null,null,null,null,5,3.2082076925428984,15,23.208207692542899,null,420,0,{"$f":"SUM(P$10:P429)/O429","v":0.59523809523809523},0.3508665854451678]
[{"$f":"A$7+RAND()*A$8","v":17.248310787324186},16.89897992287581,16.89897992287581,12.932891609522782,29.831871532398594,null,null,null,null,5,3.1926201469714952,15,23.192620146971496,null,421,0,{"$f":"SUM(P$10:P430)/O430","v":0.59382422802850354},6.639251385427098]
[6.7220228364435686,15.790357915224746,6.7220228364435686,17.667147669382793,24.38917050582636,null,null,null,null,5,2.2296354304317441,15,22.229635430431745,null,422,0,{"$f":"SUM(P$10:P431)/O431","v":0.59241706161137442},2.159535075394615]
[16.423388874247355,16.009809216636071,16.009809216636071,17.812270289226511,33.822079505862582,null,null,null,null,5,2.5951280529733296,15,22.59512805297333,null,423,0,{"$f":"SUM(P$10:P432)/O432","v":0.59101654846335694},11.226951452889253]
[3.2654380829850993,16.957690252103689,3.2654380829850993,17.323487717698836,20.588925800683935,null,null,null,null,5,0.1594349015220714,15,20.159434901522072,null,424,0,{"$f":"SUM(P$10:P433)/O433","v":0.589622641509434},0.42949089916186267]
[15.709242234846805,8.0687731251447374,8.0687731251447374,12.01932837322844,20.088101498373177,null,null,null,null,5,3.0533684273266077,15,23.053368427326607,null,425,1,{"$f":"SUM(P$10:P434)/O434","v":0.59058823529411764},-2.9652669289534295]
[4.802307429262191,11.620997206918515,4.802307429262191,14.177272238060265,18.979579667322454,null,null,null,null,5,7.9445038935151979E-2,15,20.079445038935152,null,426,1,{"$f":"SUM(P$10:P435)/O435","v":0.59154929577464788},-1.0998653716126974]
[18.183195688440399,10.256541136760136,10.256541136760136,16.986686882477148,27.243228019237286,null,null,null,null,5,0.97130203052301078,15,20.971302030523013,null,427,0,{"$f":"SUM(P$10:P436)/O436","v":0.5901639344262295},6.2719259887142726]
[13.649732489685167,16.738298224183485,13.649732489685167,16.630744438600235,30.280476928285402,null,null,null,null,5,2.4429810483761387,15,22.44298104837614,null,428,0,{"$f":"SUM(P$10:P437)/O437","v":0.58878504672897192},7.8374958799092624]
[1.5500318050948358,16.003874741058198,1.5500318050948358,13.676470068401811,15.226501873496646,null,null,null,null,5,1.0769038585014563,15,21.076903858501456,null,429,1,{"$f":"SUM(P$10:P438)/O438","v":0.58974358974358976},-5.8504019850048099]
[9.5629809079187673,15.062677096648693,9.5629809079187673,13.23151488556924,22.794495793488007,null,null,null,null,5,2.9927237292317646,15,22.992723729231763,null,430,1,{"$f":"SUM(P$10:P439)/O439","v":0.59069767441860466},-0.19822793574375552]
[10.088628741281298,0.80073846886936195,0.80073846886936195,15.714529275683681,16.515267744553043,null,null,null,null,5,2.5603502165451628,15,22.560350216545164,null,431,1,{"$f":"SUM(P$10:P440)/O440","v":0.59164733178654294},-6.0450824719921208]
[13.665575979040973,19.300708917292642,13.665575979040973,17.968084241136481,31.633660220177454,null,null,null,null,5,1.1260859546077939,15,21.126085954607795,null,432,0,{"$f":"SUM(P$10:P441)/O441","v":0.59027777777777779},10.507574265569659]
[9.3865578750056695,6.7166337034499506,6.7166337034499506,14.103807437227063,20.820441140677012,null,null,null,null,5,4.1127349911493241,15,24.112734991149324,null,433,1,{"$f":"SUM(P$10:P442)/O442","v":0.59122401847575057},-3.292293850472312]
[1.0220265501606351,7.2412624556530636,1.0220265501606351,15.459481359614248,16.481507909774884,null,null,null,null,5,4.7706680068537786,15,24.770668006853779,null,434,1,{"$f":"SUM(P$10:P443)/O443","v":0.59216589861751157},-8.289160097078895]
[12.058978180324061,6.5779162984642898,6.5779162984642898,15.547745346750961,22.125661645215253,null,null,null,null,5,3.4558910961747227,15,23.455891096174724,null,435,1,{"$f":"SUM(P$10:P444)/O444","v":0.59310344827586203},-1.3302294509594716]
[15.006925937359741,8.3230311488687487,8.3230311488687487,17.753595014594865,26.076626163463615,null,null,null,null,5,1.8519530554264669,15,21.851953055426467,null,436,0,{"$f":"SUM(P$10:P445)/O445","v":0.59174311926605505},4.2246731080371482]
[6.7985759324043427,9.0816317321945572,6.7985759324043427,17.15363219355639,23.952208125960734,null,null,null,null,5,3.6917791917834486,15,23.69177919178345,null,437,0,{"$f":"SUM(P$10:P446)/O446","v":0.59038901601830662},0.26042893417728408]
[6.7850411762512959,19.77102410087787,6.7850411762512959,16.705570172889225,23.490611349140522,null,null,null,null,5,0.77083510224936758,15,20.770835102249368,null,438,0,{"$f":"SUM(P$10:P447)/O447","v":0.58904109589041098},2.7197762468911542]
[2.3808576344268872,8.4545159313191434,2.3808576344268872,16.861102315594746,19.241959950021634,null,null,null,null,5,1.7251633973067848,15,21.725163397306783,null,439,1,{"$f":"SUM(P$10:P448)/O448","v":0.58997722095671978},-2.483203447285149]
[12.41998548149995,15.27503874473444,12.41998548149995,16.219131033949139,28.639116515449089,null,null,null,null,5,4.673216838825283,15,24.673216838825283,null,440,0,{"$f":"SUM(P$10:P449)/O449","v":0.58863636363636362},3.9658996766238062]
[{"$f":"A$7+RAND()*A$8","v":5.8554033863841433},19.492231591711302,5.8554033863841433,16.25428166869796,22.109685055082103,null,null,null,null,5,3.8145199542803807,15,23.814519954280382,null,441,1,{"$f":"SUM(P$10:P450)/O450","v":0.58956916099773238},-1.7048348991982785]
[17.95011060970716,5.738638136239846,5.738638136239846,15.880667442078362,21.619305578318208,null,null,null,null,5,2.4044153339628194,15,22.40441533396282,null,442,1,{"$f":"SUM(P$10:P451)/O451","v":0.5904977375565611},-0.78510975564461205]
[4.5094736042302692,15.819172947297472,4.5094736042302692,13.517417143018376,18.026890747248643,null,null,null,null,5,3.9546237424665098,15,23.954623742466509,null,443,1,{"$f":"SUM(P$10:P452)/O452","v":0.5914221218961625},-5.9277329952178661]
[11.373781324143168,7.8487682541549697,7.8487682541549697,14.880055954354464,22.728824208509433,null,null,null,null,5,2.7878589681875887,15,22.787858968187589,null,444,1,{"$f":"SUM(P$10:P453)/O453","v":0.59234234234234229},-5.9034759678155524E-2]
[4.0502174922682954,18.715867275038804,4.0502174922682954,12.612689607158186,16.662907099426484,null,null,null,null,5,3.2071486121797834,15,23.207148612179783,null,445,1,{"$f":"SUM(P$10:P454)/O454","v":0.59325842696629216},-6.5442415127532989]
[18.144678905649595,10.18785005752515,10.18785005752515,12.96346318439509,23.151313241920242,null,null,null,null,5,0.8225554216058778,15,20.822555421605877,null,446,0,{"$f":"SUM(P$10:P455)/O455","v":0.59192825112107628},2.3287578203143653]
[2.9856700718442308,10.074200405470659,2.9856700718442308,14.840341182744707,17.826011254588938,null,null,null,null,5,2.2844492169837602,15,22.284449216983759,null,447,1,{"$f":"SUM(P$10:P456)/O456","v":0.59284116331096193},-4.4584379623948216]
[9.6894116265895285,0.22895071120449195,0.22895071120449195,15.713776783428287,15.942727494632779,null,null,null,null,5,3.3506792778308463,15,23.350679277830846,null,448,1,{"$f":"SUM(P$10:P457)/O457","v":0.59375},-7.407951783198067]
[9.691450583711287,2.552530541282394,{"$f":"MIN(A458:B458)","v":2.552530541282394},{"$f":"D$7+RAND()*D$8","v":13.508977786660598},{"$f":"D458+C458","v":16.061508327942992},null,null,null,null,5,{"$f":"K$7+RAND()*K$8","v":3.8833980452133225},15,{"$f":"L458+K458+J458","v":23.883398045213323},null,449,{"$f":"(E458<M458)*1","v":1},{"$f":"SUM(P$10:P458)/O458","v":0.59465478841870822},{"$f":"E458-M458","v":-7.8218897172703308}]
[13.967484145140201,13.307109042020617,13.307109042020617,14.383865144191244,27.690974186211861,null,null,null,null,5,2.8052935780252488,15,22.80529357802525,null,{"$f":"O458+1","v":450},0,{"$f":"SUM(P$10:P459)/O459","v":0.59333333333333338},4.8856806081866111]
[6.4225543809966172,7.9672981970011758,6.4225543809966172,12.400801952324167,18.823356333320785,null,null,null,null,5,0.16702963598502096,15,20.167029635985021,null,451,1,{"$f":"SUM(P$10:P460)/O460","v":0.59423503325942351},-1.3436733026642358]
[6.1142286070090996,19.830709881927316,6.1142286070090996,14.6673573137991,20.781585920808197,null,null,null,null,5,2.6972904651426761,15,22.697290465142675,null,452,1,{"$f":"SUM(P$10:P461)/O461","v":0.59513274336283184},-1.9157045443344778]
[8.1478545737863932,1.4419903864419936,1.4419903864419936,16.474164625768367,17.916155012210361,null,null,null,null,5,3.1900872128315934,15,23.190087212831592,null,453,1,{"$f":"SUM(P$10:P462)/O462","v":0.59602649006622521},-5.2739322006212319]
[11.108712205255095,2.2336199999792394,2.2336199999792394,17.353921958068575,19.587541958047815,null,null,null,null,5,4.9532341288683917,15,24.953234128868392,null,454,1,{"$f":"SUM(P$10:P463)/O463","v":0.59691629955947134},-5.3656921708205765]
[14.07193432033047,3.1147366755460837,3.1147366755460837,16.647843348823748,19.762580024369832,null,null,null,null,5,4.9748759070419766,15,24.974875907041977,null,455,1,{"$f":"SUM(P$10:P464)/O464","v":0.59780219780219779},-5.2122958826721444]
[3.4491766950525915,6.9969687960583649,3.4491766950525915,13.194738534453077,16.643915229505669,null,null,null,null,5,3.3333618914564713,15,23.33336189145647,null,456,1,{"$f":"SUM(P$10:P465)/O465","v":0.59868421052631582},-6.6894466619508002]
[10.619195566795332,9.7002239898597349,9.7002239898597349,14.106875066156384,23.807099056016121,null,null,null,null,5,4.8550041976418097,15,24.855004197641811,null,457,1,{"$f":"SUM(P$10:P466)/O466","v":0.59956236323851209},-1.0479051416256908]
[4.5856150750952773,9.6011185149886984,4.5856150750952773,15.848527247397925,20.434142322493202,null,null,null,null,5,2.7176535661216144,15,22.717653566121616,null,458,1,{"$f":"SUM(P$10:P467)/O467","v":0.60043668122270744},-2.2835112436284142]
[19.810149660740375,19.221863195329195,19.221863195329195,15.052579576950938,34.274442772280132,null,null,null,null,5,2.2979686012000347,15,22.297968601200033,null,459,0,{"$f":"SUM(P$10:P468)/O468","v":0.59912854030501095},11.976474171080099]
[5.8861439415417793,15.531796048635462,5.8861439415417793,13.667472280327631,19.553616221869412,null,null,null,null,5,1.4180102061730109,15,21.418010206173012,null,460,1,{"$f":"SUM(P$10:P469)/O469","v":0.6},-1.8643939843036001]
[{"$f":"A$7+RAND()*A$8","v":2.9969399163753629},2.4735813303958532,2.4735813303958532,16.575473845637692,19.049055176033544,null,null,null,null,5,3.5704763906880217,15,23.570476390688022,null,461,1,{"$f":"SUM(P$10:P470)/O470","v":0.60086767895878523},-4.5214212146544774]
[5.3226815565470016,1.2152272776578932,1.2152272776578932,12.082844597457537,13.298071875115431,null,null,null,null,5,4.7577592440379259,15,24.757759244037928,null,462,1,{"$f":"SUM(P$10:P471)/O471","v":0.60173160173160178},-11.459687368922497]
[19.669146201567742,2.2962505203078898,2.2962505203078898,12.326311655526604,14.622562175834494,null,null,null,null,5,4.060150565628974,15,24.060150565628973,null,463,1,{"$f":"SUM(P$10:P472)/O472","v":0.60259179265658747},-9.4375883897944792]
[16.998978506111019,14.518277346037456,14.518277346037456,16.45989251951633,30.978169865553788,null,null,null,null,5,2.0913850846452293,15,22.091385084645228,null,464,0,{"$f":"SUM(P$10:P473)/O473","v":0.60129310344827591},8.8867847809085596]
[15.519614972459904,7.887237849921509,7.887237849921509,12.701886930533767,20.589124780455275,null,null,null,null,5,2.2492598822646941,15,22.249259882264695,null,465,1,{"$f":"SUM(P$10:P474)/O474","v":0.60215053763440862},-1.6601351018094199]
[10.110579666822483,16.555952464565671,10.110579666822483,16.601211033379816,26.7117907002023,null,null,null,null,5,2.5384785324263985,15,22.538478532426399,null,466,0,{"$f":"SUM(P$10:P475)/O475","v":0.60085836909871249},4.1733121677759009]
[9.1311162796957763,0.83941107759460953,0.83941107759460953,15.595962136782951,16.435373214377559,null,null,null,null,5,3.0518346721255818,15,23.051834672125583,null,467,1,{"$f":"SUM(P$10:P476)/O476","v":0.60171306209850106},-6.6164614577480236]
[18.223143352262774,18.565143325422163,18.223143352262774,12.975596760348061,31.198740112610835,null,null,null,null,5,0.76620691191297718,15,20.766206911912978,null,468,0,{"$f":"SUM(P$10:P477)/O477","v":0.6004273504273504},10.432533200697858]
[18.287342700926875,2.7323310169959991,2.7323310169959991,12.595077492880641,15.327408509876641,null,null,null,null,5,2.662382221818393,15,22.662382221818394,null,469,1,{"$f":"SUM(P$10:P478)/O478","v":0.6012793176972282},-7.3349737119417533]
[19.440524248127446,1.0019278908135587,1.0019278908135587,12.108757149967587,13.110685040781146,null,null,null,null,5,4.5465303585430323,15,24.546530358543031,null,470,1,{"$f":"SUM(P$10:P479)/O479","v":0.60212765957446812},-11.435845317761885]
[16.979055097428269,16.669813518164652,16.669813518164652,15.782895312489885,32.452708830654537,null,null,null,null,5,1.1446522926088094,15,21.144652292608811,null,471,0,{"$f":"SUM(P$10:P480)/O480","v":0.60084925690021229},11.308056538045726]
[9.8535397466974199,15.825722781751651,9.8535397466974199,12.493933039897479,22.347472786594899,null,null,null,null,5,3.9545926640205096,15,23.95459266402051,null,472,1,{"$f":"SUM(P$10:P481)/O481","v":0.60169491525423724},-1.6071198774256104]
[10.742730748812308,4.9161552892277527,4.9161552892277527,17.996709855519704,22.912865144747457,null,null,null,null,5,2.9634305324563694,15,22.963430532456371,null,473,1,{"$f":"SUM(P$10:P482)/O482","v":0.60253699788583515},-5.05653877089145E-2]
[17.632979074666085,16.915051912410664,16.915051912410664,14.011362948306195,30.926414860716861,null,null,null,null,5,2.2672520501360651,15,22.267252050136065,null,474,0,{"$f":"SUM(P$10:P483)/O483","v":0.60126582278481011},8.6591628105807956]
[11.682923566635367,14.214745601652135,11.682923566635367,17.651442153147986,29.334365719783353,null,null,null,null,5,4.5238616453794087,15,24.523861645379409,null,475,0,{"$f":"SUM(P$10:P484)/O484","v":0.6},4.8105040744039442]
[11.303551419249596,4.988172712893892,4.988172712893892,12.088850630538724,17.077023343432614,null,null,null,null,5,1.6023459022326896,15,21.602345902232688,null,476,1,{"$f":"SUM(P$10:P485)/O485","v":0.60084033613445376},-4.5253225588000738]
[1.4698567431566523,2.5518904152277888,1.4698567431566523,15.768015156574275,17.237871899730926,null,null,null,null,5,4.8934708473267055,15,24.893470847326704,null,477,1,{"$f":"SUM(P$10:P486)/O486","v":0.60167714884696022},-7.6555989475957773]
[19.17093701483353,15.363155458149599,15.363155458149599,13.77726447167492,29.140419929824517,null,null,null,null,5,3.7769713777237559,15,23.776971377723754,null,478,0,{"$f":"SUM(P$10:P487)/O487","v":0.60041841004184104},5.3634485521007633]
[17.888712638947364,12.903994508185626,12.903994508185626,13.84440937486486,26.748403883050486,null,null,null,null,5,1.8722854921396859,15,21.872285492139685,null,479,0,{"$f":"SUM(P$10:P488)/O488","v":0.59916492693110646},4.8761183909108006]
[13.455524985710461,10.846508573677065,10.846508573677065,13.067731837158679,23.914240410835745,null,null,null,null,5,1.0819373184461056,15,21.081937318446105,null,480,0,{"$f":"SUM(P$10:P489)/O489","v":0.59791666666666665},2.8323030923896404]
[{"$f":"A$7+RAND()*A$8","v":10.056737139221779},19.36794742016188,10.056737139221779,14.964237877961928,25.020975017183709,null,null,null,null,5,1.5440944808577006,15,21.544094480857702,null,481,0,{"$f":"SUM(P$10:P490)/O490","v":0.59667359667359665},3.4768805363260071]
[1.8025710055597366,3.2414815657064233,1.8025710055597366,14.213378211420805,16.015949216980541,null,null,null,null,5,4.5567531558110481,15,24.556753155811048,null,482,1,{"$f":"SUM(P$10:P491)/O491","v":0.59751037344398339},-8.540803938830507]
[3.8075349346726362,16.249408463999966,3.8075349346726362,16.177901770341737,19.985436705014372,null,null,null,null,5,4.5493272258223714,15,24.54932722582237,null,483,1,{"$f":"SUM(P$10:P492)/O492","v":0.59834368530020698},-4.5638905208079983]
[11.165290246607981,17.777902252924402,11.165290246607981,14.335298083822725,25.500588330430705,null,null,null,null,5,2.6536322264250072,15,22.653632226425007,null,484,0,{"$f":"SUM(P$10:P493)/O493","v":0.59710743801652888},2.8469561040056988]
[1.9270511821711978,2.201069468582959,1.9270511821711978,13.894710228143733,15.821761410314931,null,null,null,null,5,2.0216619056492995,15,22.021661905649299,null,485,1,{"$f":"SUM(P$10:P494)/O494","v":0.59793814432989689},-6.1999004953343686]
[5.2325223271288168,10.505681834760294,5.2325223271288168,17.497156341156014,22.72967866828483,null,null,null,null,5,3.5331828773878056,15,23.533182877387805,null,486,1,{"$f":"SUM(P$10:P495)/O495","v":0.59876543209876543},-0.80350420910297515]
[10.060141436584928,17.455774934438395,10.060141436584928,14.03783675024712,24.097978186832048,null,null,null,null,5,2.5899727146838081E-2,15,20.025899727146836,null,487,0,{"$f":"SUM(P$10:P496)/O496","v":0.59753593429158114},4.072078459685212]
[10.812727130549893,16.568903921640604,10.812727130549893,15.150326142252885,25.963053272802778,null,null,null,null,5,0.67106963605516545,15,20.671069636055165,null,488,0,{"$f":"SUM(P$10:P497)/O497","v":0.59631147540983609},5.291983636747613]
[4.1834907395237897,5.3816660235162317,4.1834907395237897,12.166930446788143,16.350421186311934,null,null,null,null,5,3.8247403116574752,15,23.824740311657475,null,489,1,{"$f":"SUM(P$10:P498)/O498","v":0.59713701431492838},-7.4743191253455414]
[9.6774752677460807,17.057166307818228,9.6774752677460807,17.646500181350213,27.323975449096295,null,null,null,null,5,1.9024024008829732,15,21.902402400882973,null,490,0,{"$f":"SUM(P$10:P499)/O499","v":0.59591836734693882},5.4215730482133218]
[15.449877350446526,7.0461504030871698,7.0461504030871698,17.792036290688369,24.83818669377554,null,null,null,null,5,0.90873678650337464,15,20.908736786503376,null,491,0,{"$f":"SUM(P$10:P500)/O500","v":0.59470468431771895},3.9294499072721649]
[9.6240920088509814,3.6467715196583694,3.6467715196583694,14.889181013580755,18.535952533239126,null,null,null,null,5,0.26883501046929159,15,20.268835010469292,null,492,1,{"$f":"SUM(P$10:P501)/O501","v":0.59552845528455289},-1.7328824772301665]
[17.404829601514976,11.608997967805415,11.608997967805415,13.710752122458169,25.319750090263582,null,null,null,null,5,4.7366490752677013,15,24.7366490752677,null,493,0,{"$f":"SUM(P$10:P502)/O502","v":0.59432048681541583},0.58310101499588285]
[2.0066804051590781,9.3288051183869634,2.0066804051590781,13.691585734008738,15.698266139167817,null,null,null,null,5,1.6121836409767916,15,21.612183640976792,null,494,1,{"$f":"SUM(P$10:P503)/O503","v":0.59514170040485825},-5.9139175018089745]
[15.349454649212326,6.4893496404761963,6.4893496404761963,14.545569293447242,21.034918933923439,null,null,null,null,5,1.2096817984147163,15,21.209681798414717,null,495,1,{"$f":"SUM(P$10:P504)/O504","v":0.59595959595959591},-0.17476286449127798]
[3.6746635390631055,0.97664245901619262,0.97664245901619262,17.75221010269648,18.728852561712674,null,null,null,null,5,4.9137853323108169,15,24.913785332310816,null,496,1,{"$f":"SUM(P$10:P505)/O505","v":0.59677419354838712},-6.1849327705981416]
[0.95572220050068823,16.532738359563155,0.95572220050068823,15.446206576826784,16.401928777327473,null,null,null,null,5,0.50179114765014521,15,20.501791147650145,null,497,1,{"$f":"SUM(P$10:P506)/O506","v":0.59758551307847085},-4.099862370322672]
[19.315936192052664,5.8138710615615397,5.8138710615615397,15.245665024866703,21.059536086428242,null,null,null,null,5,4.7529215779766547,15,24.752921577976654,null,498,1,{"$f":"SUM(P$10:P507)/O507","v":0.59839357429718876},-3.6933854915484119]
[14.020535544469032,4.7812613023957296,4.7812613023957296,17.900267826232938,22.681529128628668,null,null,null,null,5,3.4709192010050289,15,23.470919201005028,null,499,1,{"$f":"SUM(P$10:P508)/O508","v":0.59919839679358722},-0.78939007237636005]
[18.444468900489561,10.921345420365203,10.921345420365203,14.994281197768402,25.915626618133604,null,null,null,null,5,2.0572134838869829,15,22.057213483886983,null,500,0,{"$f":"SUM(P$10:P509)/O509","v":0.59799999999999998},3.8584131342466215]
[{"$f":"A$7+RAND()*A$8","v":19.398469353843176},5.778912817684998,5.778912817684998,14.555436803266279,20.334349620951276,null,null,null,null,5,2.4510151135050098,15,22.451015113505008,null,501,1,{"$f":"SUM(P$10:P510)/O510","v":0.59880239520958078},-2.1166654925537323]
[14.007754585168165,10.939663178548496,10.939663178548496,15.998024121974296,26.937687300522793,null,null,null,null,5,2.6397218734776744,15,22.639721873477676,null,502,0,{"$f":"SUM(P$10:P511)/O511","v":0.59760956175298807},4.2979654270451171]
[3.5877654150261429,10.595272916430737,3.5877654150261429,16.005647399753141,19.593412814779285,null,null,null,null,5,3.3891252431020709,15,23.389125243102072,null,503,1,{"$f":"SUM(P$10:P512)/O512","v":0.59840954274353875},-3.795712428322787]
[8.6469082750037103,0.70189047301083551,0.70189047301083551,15.862354638296575,16.564245111307411,null,null,null,null,5,4.902014038223216,15,24.902014038223214,null,504,1,{"$f":"SUM(P$10:P513)/O513","v":0.59920634920634919},-8.3377689269158033]
[11.404795472583933,10.255771994667864,10.255771994667864,17.910779281409837,28.166551276077701,null,null,null,null,5,1.3887622852362258,15,21.388762285236226,null,505,0,{"$f":"SUM(P$10:P514)/O514","v":0.598019801980198},6.7777889908414757]
[17.775253559509885,1.5342872392411433,1.5342872392411433,15.323412658942715,16.85769989818386,null,null,null,null,5,1.2991621024886613,15,21.299162102488662,null,506,1,{"$f":"SUM(P$10:P515)/O515","v":0.59881422924901184},-4.441462204304802]
[5.2311986695052308,17.316910654591439,5.2311986695052308,15.99244433616615,21.223643005671381,null,null,null,null,5,5.4578757238200604E-2,15,20.0545787572382,null,507,0,{"$f":"SUM(P$10:P516)/O516","v":0.59763313609467461},1.1690642484331804]
[19.786551005405318,10.577036137724109,10.577036137724109,13.196948746813156,23.773984884537263,null,null,null,null,5,2.5801803757808313,15,22.580180375780831,null,508,0,{"$f":"SUM(P$10:P517)/O517","v":0.59645669291338588},1.1938045087564326]
[0.73985768984089706,5.6152674790199431,0.73985768984089706,13.527915633148048,14.267773322988944,null,null,null,null,5,1.2364721901781612,15,21.236472190178162,null,509,1,{"$f":"SUM(P$10:P518)/O518","v":0.59724950884086447},-6.968698867189218]
[4.8160749547908228,4.5762418163547576,4.5762418163547576,14.010711303187122,18.586953119541882,null,null,null,null,5,4.936100041223642,15,24.936100041223643,null,510,1,{"$f":"SUM(P$10:P519)/O519","v":0.59803921568627449},-6.3491469216817613]
[17.770843548232584,4.9402616323078385,4.9402616323078385,14.550082159174405,19.490343791482243,null,null,null,null,5,3.942798903175937,15,23.942798903175937,null,511,1,{"$f":"SUM(P$10:P520)/O520","v":0.598825831702544},-4.4524551116936948]
[17.404677146281543,5.8705605900559359,5.8705605900559359,16.067444665240828,21.938005255296765,null,null,null,null,5,2.0807969767552441,15,22.080796976755245,null,512,1,{"$f":"SUM(P$10:P521)/O521","v":0.599609375},-0.14279172145847951]
[14.996810581330024,1.4715323179329598,{"$f":"MIN(A522:B522)","v":1.4715323179329598},{"$f":"D$7+RAND()*D$8","v":13.974930552343208},{"$f":"D522+C522","v":15.446462870276168},null,null,null,null,5,{"$f":"K$7+RAND()*K$8","v":0.90486006191703883},15,{"$f":"L522+K522+J522","v":20.904860061917038},null,513,{"$f":"(E522<M522)*1","v":1},{"$f":"SUM(P$10:P522)/O522","v":0.60038986354775825},{"$f":"E522-M522","v":-5.45839719164087}]
[8.3123811530163856,1.2615387688228696,1.2615387688228696,14.348547517073333,15.610086285896204,null,null,null,null,5,4.87646322763639,15,24.876463227636389,null,{"$f":"O522+1","v":514},1,{"$f":"SUM(P$10:P523)/O523","v":0.60116731517509725},-9.2663769417401856]
[18.272691197167408,11.635357824780561,11.635357824780561,16.750087459298285,28.385445284078848,null,null,null,null,5,2.4005718780636731,15,22.400571878063673,null,515,0,{"$f":"SUM(P$10:P524)/O524","v":0.6},5.9848734060151756]
[2.4782234122787861,15.287500090612644,2.4782234122787861,17.179503368957366,19.657726781236153,null,null,null,null,5,0.95463948150643296,15,20.954639481506433,null,516,1,{"$f":"SUM(P$10:P525)/O525","v":0.60077519379844957},-1.2969127002702798]
[12.520891031073196,17.764065028988433,12.520891031073196,15.169186746845686,27.69007777791888,null,null,null,null,5,1.4880518463797059,15,21.488051846379705,null,517,0,{"$f":"SUM(P$10:P526)/O526","v":0.59961315280464211},6.2020259315391755]
[9.6345783301783872,0.1536374585736211,0.1536374585736211,16.004779945379155,16.158417403952775,null,null,null,null,5,2.1668072071338154,15,22.166807207133814,null,518,1,{"$f":"SUM(P$10:P527)/O527","v":0.60038610038610041},-6.0083898031810392]
[19.030920684288326,15.587135427999748,15.587135427999748,14.230818631952022,29.81795405995177,null,null,null,null,5,2.7081573016588472,15,22.708157301658847,null,519,0,{"$f":"SUM(P$10:P528)/O528","v":0.59922928709055878},7.1097967582929229]
[16.857938985037602,16.685654703336123,16.685654703336123,16.938338532401247,33.623993235737373,null,null,null,null,5,0.94255025841089801,15,20.942550258410897,null,520,0,{"$f":"SUM(P$10:P529)/O529","v":0.59807692307692306},12.681442977326476]
[{"$f":"A$7+RAND()*A$8","v":19.635260011533951},13.912413774025719,13.912413774025719,17.884337678151052,31.796751452176771,null,null,null,null,5,4.4103077260755716,15,24.410307726075573,null,521,0,{"$f":"SUM(P$10:P530)/O530","v":0.59692898272552786},7.3864437261011986]
[14.973893252232951,4.2297460329245755,4.2297460329245755,14.199576557785308,18.429322590709884,null,null,null,null,5,0.35658601442006943,15,20.356586014420067,null,522,1,{"$f":"SUM(P$10:P531)/O531","v":0.5977011494252874},-1.9272634237101833]
[1.0940097579593422,3.2494538407689455,1.0940097579593422,12.163793205593997,13.257802963553338,null,null,null,null,5,4.5354519772715154,15,24.535451977271514,null,523,1,{"$f":"SUM(P$10:P532)/O532","v":0.59847036328871894},-11.277649013718175]
[14.925146709661467,5.2878917863720742,5.2878917863720742,15.811258347976548,21.099150134348623,null,null,null,null,5,4.0850298886394123,15,24.085029888639411,null,524,1,{"$f":"SUM(P$10:P533)/O533","v":0.5992366412213741},-2.9858797542907887]
[13.912732335013626,5.3669816578356606,5.3669816578356606,16.600787735352586,21.967769393188249,null,null,null,null,5,4.3403425703989686,15,24.340342570398967,null,525,1,{"$f":"SUM(P$10:P534)/O534","v":0.6},-2.3725731772107181]
[9.1884497693700062,8.1383990459123989,8.1383990459123989,13.374093463276683,21.51249250918908,null,null,null,null,5,4.3796500428164338,15,24.379650042816433,null,526,1,{"$f":"SUM(P$10:P535)/O535","v":0.60076045627376429},-2.8671575336273527]
[3.2036729282454157E-2,18.696489631350811,3.2036729282454157E-2,17.438653266147998,17.470689995430451,null,null,null,null,5,0.63595603673309853,15,20.635956036733099,null,527,1,{"$f":"SUM(P$10:P536)/O536","v":0.60151802656546494},-3.1652660413026474]
[2.0324055959749887,4.9903669315512778,2.0324055959749887,15.078388994736478,17.110794590711468,null,null,null,null,5,1.9367311118098907,15,21.936731111809891,null,528,1,{"$f":"SUM(P$10:P537)/O537","v":0.60227272727272729},-4.8259365210984235]
[9.9632640406704809,10.899268757073276,9.9632640406704809,13.434484471081614,23.397748511752095,null,null,null,null,5,3.4981158605819811,15,23.498115860581983,null,529,1,{"$f":"SUM(P$10:P538)/O538","v":0.60302457466918713},-0.10036734882988796]
[13.237308768365255,8.3854032513539529,8.3854032513539529,14.532767951486544,22.918171202840497,null,null,null,null,5,1.5063659509548133,15,21.506365950954812,null,530,0,{"$f":"SUM(P$10:P539)/O539","v":0.60188679245283017},1.411805251885685]
[15.191292979181988,10.600411313499475,10.600411313499475,12.180892218943725,22.7813035324432,null,null,null,null,5,0.21034719540994506,15,20.210347195409945,null,531,0,{"$f":"SUM(P$10:P540)/O540","v":0.60075329566854996},2.5709563370332553]
[1.3493544697899496,17.080477463386707,1.3493544697899496,13.94686210528816,15.296216575078109,null,null,null,null,5,3.006213955390125,15,23.006213955390123,null,532,1,{"$f":"SUM(P$10:P541)/O541","v":0.60150375939849621},-7.7099973803120143]
[17.811591382781302,6.0679960751190531,6.0679960751190531,14.162410488035661,20.230406563154716,null,null,null,null,5,4.4653836776665559,15,24.465383677666555,null,533,1,{"$f":"SUM(P$10:P542)/O542","v":0.60225140712945591},-4.2349771145118389]
[18.211899937596179,14.876391816639332,14.876391816639332,15.675883992416457,30.552275809055789,null,null,null,null,5,1.5838478604370743,15,21.583847860437075,null,534,0,{"$f":"SUM(P$10:P543)/O543","v":0.601123595505618},8.9684279486187144]
[12.426662839903459,12.145262327054358,12.145262327054358,17.433813024634862,29.57907535168922,null,null,null,null,5,3.9527924153663396,15,23.952792415366339,null,535,0,{"$f":"SUM(P$10:P544)/O544","v":0.6},5.6262829363228803]
[15.733227196345672,9.7567022893948678,9.7567022893948678,13.156283220130693,22.912985509525562,null,null,null,null,5,2.8437905925785163,15,22.843790592578515,null,536,0,{"$f":"SUM(P$10:P545)/O545","v":0.59888059701492535},6.9194916947047602E-2]
[16.317534093382903,12.848896895765691,12.848896895765691,14.076165087819447,26.925061983585138,null,null,null,null,5,2.0131411243151458,15,22.013141124315148,null,537,0,{"$f":"SUM(P$10:P546)/O546","v":0.5977653631284916},4.9119208592699906]
[17.735003310612925,16.286506013656773,16.286506013656773,13.856606413078712,30.143112426735485,null,null,null,null,5,4.4001170930402456,15,24.400117093040244,null,538,0,{"$f":"SUM(P$10:P547)/O547","v":0.59665427509293678},5.7429953336952408]
[4.7701284913212287,4.7250683083557687,4.7250683083557687,13.729313140519867,18.454381448875637,null,null,null,null,5,3.8120763603501331,15,23.812076360350133,null,539,1,{"$f":"SUM(P$10:P548)/O548","v":0.59740259740259738},-5.3576949114744963]
[12.249842014687388,9.1696968861631589,9.1696968861631589,17.996516317576663,27.166213203739822,null,null,null,null,5,1.428783901284022,15,21.428783901284021,null,540,0,{"$f":"SUM(P$10:P549)/O549","v":0.59629629629629632},5.7374293024558014]
[{"$f":"A$7+RAND()*A$8","v":1.7963575068092896},1.7080624844461867,1.7080624844461867,16.607525729784278,18.315588214230466,null,null,null,null,5,4.8499388392639338,15,24.849938839263935,null,541,1,{"$f":"SUM(P$10:P550)/O550","v":0.59704251386321627},-6.5343506250334684]
[13.363488663573783,13.818401636655068,13.363488663573783,14.516577592386497,27.88006625596028,null,null,null,null,5,1.2232487260108922,15,21.223248726010894,null,542,0,{"$f":"SUM(P$10:P551)/O551","v":0.59594095940959413},6.6568175299493859]
[10.571931462710058,18.01418968285763,10.571931462710058,13.85849287721296,24.430424339923018,null,null,null,null,5,0.47714635141283546,15,20.477146351412834,null,543,0,{"$f":"SUM(P$10:P552)/O552","v":0.5948434622467772},3.9532779885101839]
[5.3384860726274912,9.0770904819779261,5.3384860726274912,16.344736253033368,21.683222325660857,null,null,null,null,5,4.6619782262984009,15,24.661978226298402,null,544,1,{"$f":"SUM(P$10:P553)/O553","v":0.59558823529411764},-2.9787559006375446]
[16.061672596607803,1.3668860663916971,1.3668860663916971,17.30765729602814,18.674543362419836,null,null,null,null,5,4.0977518252634297,15,24.09775182526343,null,545,1,{"$f":"SUM(P$10:P554)/O554","v":0.59633027522935778},-5.4232084628435935]
[3.9784535507806251,0.26876392080842137,0.26876392080842137,13.931719415693966,14.200483336502387,null,null,null,null,5,2.1414515081327332,15,22.141451508132732,null,546,1,{"$f":"SUM(P$10:P555)/O555","v":0.59706959706959706},-7.9409681716303453]
[1.1804255584028667,4.7511051405855582,1.1804255584028667,13.32281173023317,14.503237288636036,null,null,null,null,5,3.018194824598984,15,23.018194824598986,null,547,1,{"$f":"SUM(P$10:P556)/O556","v":0.59780621572212067},-8.5149575359629495]
[12.326006248439835,8.7049702614746067,8.7049702614746067,12.795321181866619,21.500291443341226,null,null,null,null,5,2.7332415736498095,15,22.73324157364981,null,548,1,{"$f":"SUM(P$10:P557)/O557","v":0.59854014598540151},-1.2329501303085841]
[10.152946076100076,14.315712717819107,10.152946076100076,14.395676788233231,24.548622864333307,null,null,null,null,5,0.2228577216389982,15,20.222857721638999,null,549,0,{"$f":"SUM(P$10:P558)/O558","v":0.5974499089253188},4.3257651426943085]
[14.061237567573679,1.9075673877051424,1.9075673877051424,14.186902415478855,16.094469803183998,null,null,null,null,5,3.1895403831227505,15,23.18954038312275,null,550,1,{"$f":"SUM(P$10:P559)/O559","v":0.59818181818181815},-7.0950705799387528]
[8.274181415042321,9.5509528031033142,8.274181415042321,15.666350616818736,23.940532031861057,null,null,null,null,5,3.0192710706097254,15,23.019271070609726,null,551,0,{"$f":"SUM(P$10:P560)/O560","v":0.5970961887477314},0.92126096125133117]
[19.994614682505166,6.9928230224494126E-2,6.9928230224494126E-2,12.681979636483158,12.751907866707652,null,null,null,null,5,3.8618206539512405,15,23.861820653951241,null,552,1,{"$f":"SUM(P$10:P561)/O561","v":0.59782608695652173},-11.109912787243589]
[4.1144446972945019,13.780318652824615,4.1144446972945019,15.910759247898708,20.025203945193212,null,null,null,null,5,4.1521831455169265,15,24.152183145516926,null,553,1,{"$f":"SUM(P$10:P562)/O562","v":0.59855334538878846},-4.1269792003237136]
[19.724153261677792,17.975770757535599,17.975770757535599,16.588660178077298,34.564430935612897,null,null,null,null,5,2.9562734683317111,15,22.956273468331712,null,554,0,{"$f":"SUM(P$10:P563)/O563","v":0.59747292418772568},11.608157467281185]
[12.128261173706132,11.827916060805775,11.827916060805775,17.048412597226903,28.876328658032676,null,null,null,null,5,2.5421740753496009,15,22.5421740753496,null,555,0,{"$f":"SUM(P$10:P564)/O564","v":0.59639639639639641},6.3341545826830767]
[15.267156078798349,7.80420494134429,7.80420494134429,13.969034584687885,21.773239526032174,null,null,null,null,5,4.4993858686223795,15,24.49938586862238,null,556,1,{"$f":"SUM(P$10:P565)/O565","v":0.59712230215827333},-2.7261463425902051]
[1.8574154694069422,0.35564341154904699,0.35564341154904699,14.498090712128603,14.853734123677651,null,null,null,null,5,4.7023940176058812,15,24.702394017605883,null,557,1,{"$f":"SUM(P$10:P566)/O566","v":0.59784560143626575},-9.8486598939282324]
[7.0304392740051691,9.0183029738199316,7.0304392740051691,16.616000226341725,23.646439500346894,null,null,null,null,5,2.2533811872667631,15,22.253381187266761,null,558,0,{"$f":"SUM(P$10:P567)/O567","v":0.59677419354838712},1.3930583130801324]
[0.54021089906429953,18.725791415904393,0.54021089906429953,16.293194379197377,16.833405278261676,null,null,null,null,5,2.8550225746970739,15,22.855022574697074,null,559,1,{"$f":"SUM(P$10:P568)/O568","v":0.5974955277280859},-6.021617296435398]
[14.381676897168411,10.393614143453426,10.393614143453426,13.973764990450931,24.367379133904358,null,null,null,null,5,4.9571332662126206,15,24.957133266212622,null,560,1,{"$f":"SUM(P$10:P569)/O569","v":0.5982142857142857},-0.5897541323082649]
[{"$f":"A$7+RAND()*A$8","v":1.3326154321243844},18.429687861446578,1.3326154321243844,14.696124895081599,16.028740327205984,null,null,null,null,5,1.0685608874641721,15,21.068560887464173,null,561,1,{"$f":"SUM(P$10:P570)/O570","v":0.59893048128342241},-5.0398205602581889]
[17.909204790820723,10.271099073572936,10.271099073572936,17.244642893031806,27.515741966604743,null,null,null,null,5,4.0824280365873129,15,24.082428036587313,null,562,0,{"$f":"SUM(P$10:P571)/O571","v":0.59786476868327398},3.4333139300174302]
[11.769878504244016,14.756987051232624,11.769878504244016,13.438169823903484,25.208048328147498,null,null,null,null,5,2.813763457675198,15,22.813763457675197,null,563,0,{"$f":"SUM(P$10:P572)/O572","v":0.5968028419182948},2.3942848704723012]
[14.201519098934025,1.0182034562036235,1.0182034562036235,15.759807775629366,16.778011231832988,null,null,null,null,5,4.0365818703002958,15,24.036581870300296,null,564,1,{"$f":"SUM(P$10:P573)/O573","v":0.59751773049645385},-7.2585706384673081]
[4.4924037015451308,11.238107530757983,4.4924037015451308,17.919324731058019,22.411728432603148,null,null,null,null,5,4.734323090446801,15,24.7343230904468,null,565,1,{"$f":"SUM(P$10:P574)/O574","v":0.59823008849557524},-2.322594657843652]
[12.459082059581446,18.363806881017123,12.459082059581446,17.549486265280038,30.008568324861486,null,null,null,null,5,1.3182704640429077,15,21.318270464042907,null,566,0,{"$f":"SUM(P$10:P575)/O575","v":0.59717314487632511},8.6902978608185784]
[16.954264888811593,6.1996674999239065,6.1996674999239065,15.115443559009735,21.315111058933642,null,null,null,null,5,0.66489479690458542,15,20.664894796904584,null,567,0,{"$f":"SUM(P$10:P576)/O576","v":0.59611992945326275},0.65021626202905836]
[9.8857003946299287,8.1663614493723884,8.1663614493723884,12.354721722338274,20.521083171710664,null,null,null,null,5,2.8567108664133012,15,22.856710866413302,null,568,1,{"$f":"SUM(P$10:P577)/O577","v":0.596830985915493},-2.3356276947026373]
[6.2256079846424299,11.090223989687523,6.2256079846424299,16.750480874954363,22.976088859596793,null,null,null,null,5,4.1188889057568625,15,24.118888905756862,null,569,1,{"$f":"SUM(P$10:P578)/O578","v":0.5975395430579965},-1.1428000461600689]
[10.408847202555053,5.2148661833914094,5.2148661833914094,16.421336785064977,21.636202968456388,null,null,null,null,5,4.3694137458735351,15,24.369413745873537,null,570,1,{"$f":"SUM(P$10:P579)/O579","v":0.59824561403508769},-2.733210777417149]
[1.7888586541407214,12.79196791162282,1.7888586541407214,12.281288577181234,14.070147231321956,null,null,null,null,5,4.5420737131411029,15,24.542073713141104,null,571,1,{"$f":"SUM(P$10:P580)/O580","v":0.59894921190893169},-10.471926481819148]
[6.8177918128232911,17.464420076584695,6.8177918128232911,17.725434618431528,24.543226431254819,null,null,null,null,5,4.8224699202739671,15,24.822469920273967,null,572,1,{"$f":"SUM(P$10:P581)/O581","v":0.59965034965034969},-0.27924348901914797]
[2.2390050296422048,10.317601822705932,2.2390050296422048,15.39277261632138,17.631777645963584,null,null,null,null,5,1.3788290905714173,15,21.378829090571418,null,573,1,{"$f":"SUM(P$10:P582)/O582","v":0.6003490401396161},-3.747051444607834]
[5.122303377036741,10.522737910239464,5.122303377036741,15.011723259286638,20.13402663632338,null,null,null,null,5,2.2728531702114578,15,22.272853170211459,null,574,1,{"$f":"SUM(P$10:P583)/O583","v":0.60104529616724733},-2.1388265338880785]
[6.1375905416943821,3.1172424980298352,3.1172424980298352,14.327052579931163,17.444295077960998,null,null,null,null,5,1.8622966860639001,15,21.8622966860639,null,575,1,{"$f":"SUM(P$10:P584)/O584","v":0.60173913043478255},-4.4180016081029017]
[6.5063061486923468,4.7621231508788586,4.7621231508788586,12.580110178497192,17.34223332937605,null,null,null,null,5,4.7662074442062465,15,24.766207444206245,null,576,1,{"$f":"SUM(P$10:P585)/O585","v":0.60243055555555558},-7.4239741148301945]
[12.964850763223874,10.661929434003845,{"$f":"MIN(A586:B586)","v":10.661929434003845},{"$f":"D$7+RAND()*D$8","v":17.061392471510985},{"$f":"D586+C586","v":27.72332190551483},null,null,null,null,5,{"$f":"K$7+RAND()*K$8","v":2.594084324791333},15,{"$f":"L586+K586+J586","v":22.594084324791332},null,577,{"$f":"(E586<M586)*1","v":0},{"$f":"SUM(P$10:P586)/O586","v":0.60138648180242638},{"$f":"E586-M586","v":5.1292375807234976}]
[14.6181712882869,11.167812239430805,11.167812239430805,13.758018530119118,24.925830769549925,null,null,null,null,5,2.3937590868634464,15,22.393759086863447,null,{"$f":"O586+1","v":578},0,{"$f":"SUM(P$10:P587)/O587","v":0.60034602076124566},2.5320716826864782]
[6.9049233640259544,9.0077128121983119,6.9049233640259544,12.291181097810069,19.196104461836022,null,null,null,null,5,3.04405910913504,15,23.044059109135041,null,579,1,{"$f":"SUM(P$10:P588)/O588","v":0.60103626943005184},-3.8479546472990194]
[2.6860305565614184,4.1704031758300486,2.6860305565614184,17.020134975855623,19.706165532417042,null,null,null,null,5,4.6359459505091412,15,24.635945950509139,null,580,1,{"$f":"SUM(P$10:P589)/O589","v":0.60172413793103452},-4.929780418092097]
[{"$f":"A$7+RAND()*A$8","v":1.4862304579991359},9.8290970217125526,1.4862304579991359,13.789759189983734,15.27598964798287,null,null,null,null,5,0.38727393950162947,15,20.387273939501629,null,581,1,{"$f":"SUM(P$10:P590)/O590","v":0.60240963855421692},-5.1112842915187588]
[0.65826071748398274,19.446623977466288,0.65826071748398274,17.073299812121043,17.731560529605026,null,null,null,null,5,0.75069037844396613,15,20.750690378443966,null,582,1,{"$f":"SUM(P$10:P591)/O591","v":0.60309278350515461},-3.01912984883894]
[19.65565288150119,12.710316904250949,12.710316904250949,13.213905952861573,25.924222857112522,null,null,null,null,5,1.5323653962843331,15,21.532365396284334,null,583,0,{"$f":"SUM(P$10:P592)/O592","v":0.60205831903945106},4.391857460828188]
[8.93043656172315,17.498673418058324,8.93043656172315,15.840955470810005,24.771392032533157,null,null,null,null,5,0.40895664661390163,15,20.408956646613902,null,584,0,{"$f":"SUM(P$10:P593)/O593","v":0.60102739726027399},4.3624353859192553]
[14.365758130622091,4.5777837562257551,4.5777837562257551,17.421581549290536,21.999365305516292,null,null,null,null,5,4.743034573630668,15,24.743034573630666,null,585,1,{"$f":"SUM(P$10:P594)/O594","v":0.60170940170940168},-2.7436692681143739]
[6.9973026463977339,19.403265154844185,6.9973026463977339,17.428333601105475,24.42563624750321,null,null,null,null,5,3.8529801653126086,15,23.852980165312609,null,586,0,{"$f":"SUM(P$10:P595)/O595","v":0.60068259385665534},0.57265608219060127]
[11.354963623177429,4.2235372755850031,4.2235372755850031,12.293959990601827,16.51749726618683,null,null,null,null,5,1.7447089871965598,15,21.74470898719656,null,587,1,{"$f":"SUM(P$10:P596)/O596","v":0.60136286201022149},-5.2272117210097306]
[0.12725250748655936,11.294766898142361,0.12725250748655936,12.929488159429704,13.056740666916264,null,null,null,null,5,0.19706989415084253,15,20.197069894150843,null,588,1,{"$f":"SUM(P$10:P597)/O597","v":0.60204081632653061},-7.1403292272345791]
[3.603897152736466,9.9863042686447479,3.603897152736466,17.350135183398947,20.954032336135413,null,null,null,null,5,3.1530404709641013,15,23.1530404709641,null,589,1,{"$f":"SUM(P$10:P598)/O598","v":0.60271646859083194},-2.1990081348286878]
[7.994684380262342,4.4290169586432011,4.4290169586432011,14.278064585749807,18.707081544393006,null,null,null,null,5,1.0297658335306097,15,21.029765833530611,null,590,1,{"$f":"SUM(P$10:P599)/O599","v":0.60338983050847461},-2.3226842891376052]
[6.5494450858966102,18.647003125914633,6.5494450858966102,13.276093072499155,19.825538158395766,null,null,null,null,5,0.26542976641672655,15,20.265429766416727,null,591,1,{"$f":"SUM(P$10:P600)/O600","v":0.60406091370558379},-0.43989160802096094]
[3.4047244084909267,12.77268877118213,3.4047244084909267,17.015405493697784,20.420129902188712,null,null,null,null,5,0.66104257499086827,15,20.661042574990866,null,592,1,{"$f":"SUM(P$10:P601)/O601","v":0.60472972972972971},-0.24091267280215334]
[17.337797368721816,5.135037544932743,5.135037544932743,12.510409659747459,17.645447204680202,null,null,null,null,5,2.6129816652749756,15,22.612981665274976,null,593,1,{"$f":"SUM(P$10:P602)/O602","v":0.60539629005059026},-4.9675344605947735]
[1.7265334582057656,7.2612567783293835,1.7265334582057656,16.642116263998755,18.36864972220452,null,null,null,null,5,3.0172170161902323E-2,15,20.030172170161904,null,594,1,{"$f":"SUM(P$10:P603)/O603","v":0.60606060606060608},-1.6615224479573847]
[1.6835775949464127,15.238917772902765,1.6835775949464127,16.243765444134056,17.927343039080469,null,null,null,null,5,2.3924066374237136,15,22.392406637423715,null,595,1,{"$f":"SUM(P$10:P604)/O604","v":0.60672268907563021},-4.4650635983432458]
[6.9992214787014317,19.539717925752687,6.9992214787014317,16.511375114798785,23.510596593500217,null,null,null,null,5,1.5314952460436575,15,21.531495246043658,null,596,0,{"$f":"SUM(P$10:P605)/O605","v":0.60570469798657722},1.9791013474565595]
[11.519412531713618,18.103992063922089,11.519412531713618,17.124435992081601,28.643848523795221,null,null,null,null,5,1.3929897609792081,15,21.392989760979209,null,597,0,{"$f":"SUM(P$10:P606)/O606","v":0.60469011725293131},7.2508587628160122]
[17.675302921826106,18.45516216472809,17.675302921826106,15.969622763411264,33.644925685237368,null,null,null,null,5,4.2925795401358631,15,24.292579540135861,null,598,0,{"$f":"SUM(P$10:P607)/O607","v":0.60367892976588633},9.3523461451015066]
[19.472769441944159,17.775320125635709,17.775320125635709,12.78776225972863,30.563082385364339,null,null,null,null,5,4.8605387900469132,15,24.860538790046913,null,599,0,{"$f":"SUM(P$10:P608)/O608","v":0.60267111853088484},5.7025435953174259]
[7.0290267424810011,6.1903385324314648,6.1903385324314648,15.139141061267853,21.329479593699318,null,null,null,null,5,1.3115039230759029,15,21.311503923075904,null,600,0,{"$f":"SUM(P$10:P609)/O609","v":0.60166666666666668},1.797567062341443E-2]
[{"$f":"A$7+RAND()*A$8","v":14.399206307633269},1.8248314318918268E-2,1.8248314318918268E-2,16.170622905874982,16.188871220193899,null,null,null,null,5,1.1401929813227973,15,21.140192981322798,null,601,1,{"$f":"SUM(P$10:P610)/O610","v":0.60232945091514145},-4.9513217611288987]
[13.461037138357936,13.220429702425296,13.220429702425296,17.157143321512297,30.377573023937593,null,null,null,null,5,3.4524092638302006,15,23.452409263830202,null,602,0,{"$f":"SUM(P$10:P611)/O611","v":0.6013289036544851},6.9251637601073917]
[9.9445510707926559,5.4216718486061772,5.4216718486061772,14.694290585713965,20.115962434320142,null,null,null,null,5,1.5905857298347259,15,21.590585729834725,null,603,1,{"$f":"SUM(P$10:P612)/O612","v":0.60199004975124382},-1.4746232955145828]
[3.0802238003217908,9.5452900128120319,3.0802238003217908,13.241986432466945,16.322210232788734,null,null,null,null,5,2.7803774090860767,15,22.780377409086078,null,604,1,{"$f":"SUM(P$10:P613)/O613","v":0.60264900662251653},-6.4581671762973443]
[17.440961895028316,10.926606806346918,10.926606806346918,17.940535026814157,28.867141833161075,null,null,null,null,5,3.9777570907076831,15,23.977757090707684,null,605,0,{"$f":"SUM(P$10:P614)/O614","v":0.60165289256198351},4.8893847424533909]
[17.158304146451037,8.7451042345563472,8.7451042345563472,14.216649514346409,22.961753748902758,null,null,null,null,5,3.3562183313935048,15,23.356218331393507,null,606,1,{"$f":"SUM(P$10:P615)/O615","v":0.60231023102310233},-0.39446458249074823]
[10.580528414421554,2.2798322606562382,2.2798322606562382,14.814824152797264,17.094656413453503,null,null,null,null,5,4.3990300973926475,15,24.399030097392647,null,607,1,{"$f":"SUM(P$10:P616)/O616","v":0.60296540362438222},-7.3043736839391435]
[19.134372294754279,4.7219126312551873,4.7219126312551873,14.626849336838742,19.348761968093928,null,null,null,null,5,4.7712617501895647,15,24.771261750189566,null,608,1,{"$f":"SUM(P$10:P617)/O617","v":0.60361842105263153},-5.4224997820956382]
[2.6187517369314239,2.529320020506669,2.529320020506669,12.352839878495924,14.882159899002593,null,null,null,null,5,2.4471518650298991,15,22.447151865029898,null,609,1,{"$f":"SUM(P$10:P618)/O618","v":0.60426929392446638},-7.5649919660273053]
[12.329900059489926,10.420925658661487,10.420925658661487,14.71583547371962,25.136761132381107,null,null,null,null,5,2.5328810858659989,15,22.532881085865998,null,610,0,{"$f":"SUM(P$10:P619)/O619","v":0.60327868852459021},2.6038800465151084]
[16.971424909342769,9.5197190187174545,9.5197190187174545,16.998732429072589,26.518451447790042,null,null,null,null,5,4.0072844676628439,15,24.007284467662842,null,611,0,{"$f":"SUM(P$10:P620)/O620","v":0.60229132569558097},2.5111669801272001]
[13.315515618661152,4.9742503789342241,4.9742503789342241,13.540784021921505,18.515034400855729,null,null,null,null,5,3.1862358445418648,15,23.186235844541866,null,612,1,{"$f":"SUM(P$10:P621)/O621","v":0.6029411764705882},-4.6712014436861367]
[2.8074572348938709,7.5701608380733738,2.8074572348938709,15.59137772864749,18.398834963541361,null,null,null,null,5,2.3919455587336573,15,22.391945558733656,null,613,1,{"$f":"SUM(P$10:P622)/O622","v":0.60358890701468193},-3.9931105951922952]
[11.684696832117913,13.214292012730336,11.684696832117913,12.754132920653728,24.438829752771639,null,null,null,null,5,1.0687778933186114,15,21.068777893318611,null,614,0,{"$f":"SUM(P$10:P623)/O623","v":0.60260586319218246},3.370051859453028]
[15.377413672324005,19.553847767212428,15.377413672324005,15.111828692363614,30.48924236468762,null,null,null,null,5,3.1768351302431235,15,23.176835130243123,null,615,0,{"$f":"SUM(P$10:P624)/O624","v":0.60162601626016265},7.3124072344444961]
[5.7534408155094869,1.9199990804108724,1.9199990804108724,13.195488980748753,15.115488061159624,null,null,null,null,5,4.0192813219638959,15,24.019281321963895,null,616,1,{"$f":"SUM(P$10:P625)/O625","v":0.60227272727272729},-8.9037932608042709]
[13.069570685270925,7.8055144848665048,7.8055144848665048,17.010500567206378,24.816015052072885,null,null,null,null,5,1.218040336395908,15,21.218040336395909,null,617,0,{"$f":"SUM(P$10:P626)/O626","v":0.60129659643435984},3.5979747156769761]
[8.132005355198487,3.5064270667031661,3.5064270667031661,12.730203900365559,16.236630967068727,null,null,null,null,5,2.3396913872027767,15,22.339691387202777,null,618,1,{"$f":"SUM(P$10:P627)/O627","v":0.60194174757281549},-6.1030604201340495]
[19.754857339677343,13.207107456875571,13.207107456875571,16.586075361969023,29.793182818844592,null,null,null,null,5,1.1019680980918496,15,21.101968098091849,null,619,0,{"$f":"SUM(P$10:P628)/O628","v":0.60096930533117932},8.6912147207527433]
[19.903445782118613,7.316604540886928,7.316604540886928,15.893602882057639,23.210207422944567,null,null,null,null,5,9.3831772483711218E-2,15,20.093831772483711,null,620,0,{"$f":"SUM(P$10:P629)/O629","v":0.6},3.1163756504608564]
[{"$f":"A$7+RAND()*A$8","v":12.099987744315307},5.2536919670452376,5.2536919670452376,15.059795929279403,20.313487896324641,null,null,null,null,5,2.7678158061622371,15,22.767815806162236,null,621,1,{"$f":"SUM(P$10:P630)/O630","v":0.60064412238325282},-2.4543279098375947]
[13.521303094429065,2.5120477072312042,2.5120477072312042,16.238220744141671,18.750268451372875,null,null,null,null,5,3.7569962361426663,15,23.756996236142665,null,622,1,{"$f":"SUM(P$10:P631)/O631","v":0.6012861736334405},-5.0067277847697902]
[14.023974516057113,4.2213268747667332,4.2213268747667332,13.694498347904553,17.915825222671288,null,null,null,null,5,4.7091582772294061,15,24.709158277229406,null,623,1,{"$f":"SUM(P$10:P632)/O632","v":0.6019261637239165},-6.7933330545581185]
[1.7021664691752236,17.992496803423759,1.7021664691752236,17.210137398732336,18.912303867907561,null,null,null,null,5,0.91659312092995771,15,20.91659312092996,null,624,1,{"$f":"SUM(P$10:P633)/O633","v":0.60256410256410253},-2.0042892530223995]
[0.4386239204685749,11.444792209478809,0.4386239204685749,13.195742926427158,13.634366846895734,null,null,null,null,5,2.6398258252594919,15,22.639825825259493,null,625,1,{"$f":"SUM(P$10:P634)/O634","v":0.60319999999999996},-9.0054589783637589]
[9.9826978417918451,10.171090439212648,9.9826978417918451,12.673204234197414,22.65590207598926,null,null,null,null,5,1.6117091048050303,15,21.61170910480503,null,626,0,{"$f":"SUM(P$10:P635)/O635","v":0.60223642172523961},1.0441929711842306]
[16.477232265889366,1.7555959412294464,1.7555959412294464,16.53354308160219,18.289139022831638,null,null,null,null,5,2.6914631321150422,15,22.691463132115043,null,627,1,{"$f":"SUM(P$10:P636)/O636","v":0.60287081339712922},-4.4023241092834056]
[18.561037722903606,16.770743661269531,16.770743661269531,16.376193519819523,33.146937181089058,null,null,null,null,5,3.5122155943009989,15,23.512215594300997,null,628,0,{"$f":"SUM(P$10:P637)/O637","v":0.60191082802547768},9.6347215867880607]
[12.640425401129146,11.613826639399953,11.613826639399953,16.578744910570013,28.192571549969966,null,null,null,null,5,3.6322612736597448,15,23.632261273659743,null,629,0,{"$f":"SUM(P$10:P638)/O638","v":0.60095389507154218},4.5603102763102221]
[3.8558110446943616,16.946883364652315,3.8558110446943616,16.804932778113013,20.660743822807376,null,null,null,null,5,3.1932754653549296,15,23.19327546535493,null,630,1,{"$f":"SUM(P$10:P639)/O639","v":0.60158730158730156},-2.5325316425475535]
[6.8392153144179169,17.25358433060925,6.8392153144179169,16.649698266787674,23.48891358120559,null,null,null,null,5,0.515481451459332,15,20.51548145145933,null,631,0,{"$f":"SUM(P$10:P640)/O640","v":0.60063391442155312},2.9734321297462607]
[15.884448821376477,2.7810888929888788,2.7810888929888788,16.388655175145683,19.169744068134563,null,null,null,null,5,0.99731577665766291,15,20.997315776657665,null,632,1,{"$f":"SUM(P$10:P641)/O641","v":0.60126582278481011},-1.8275717085231022]
[13.8418246502778,13.161551787832691,13.161551787832691,15.067688480177992,28.229240268010685,null,null,null,null,5,0.14904676499330916,15,20.149046764993308,null,633,0,{"$f":"SUM(P$10:P642)/O642","v":0.60031595576619279},8.0801935030173766]
[18.735518205895755,2.0104076413371508,2.0104076413371508,16.927839966203724,18.938247607540873,null,null,null,null,5,4.4669432058790166,15,24.466943205879016,null,634,1,{"$f":"SUM(P$10:P643)/O643","v":0.60094637223974767},-5.5286955983381425]
[13.514365226905692,8.1031160570992533,8.1031160570992533,14.933653486813135,23.036769543912389,null,null,null,null,5,1.6947979069327868,15,21.694797906932788,null,635,0,{"$f":"SUM(P$10:P644)/O644","v":0.6},1.3419716369796006]
[9.5235025748879387,13.997999729497346,9.5235025748879387,14.463752422105451,23.987254996993389,null,null,null,null,5,3.6504687743569826,15,23.650468774356984,null,636,0,{"$f":"SUM(P$10:P645)/O645","v":0.59905660377358494},0.33678622263640534]
[18.33330625335552,8.8467220236239328,8.8467220236239328,17.186586764964606,26.033308788588538,null,null,null,null,5,1.272870537561992,15,21.272870537561992,null,637,0,{"$f":"SUM(P$10:P646)/O646","v":0.59811616954474101},4.7604382510265459]
[15.419243331397364,1.1224773987602266,1.1224773987602266,14.52051110090007,15.642988499660296,null,null,null,null,5,4.9273436568210194,15,24.927343656821019,null,638,1,{"$f":"SUM(P$10:P647)/O647","v":0.59874608150470221},-9.2843551571607232]
[8.4344025360011905,12.101313259002573,8.4344025360011905,17.815506880187126,26.249909416188316,null,null,null,null,5,3.1108454470835323,15,23.110845447083534,null,639,0,{"$f":"SUM(P$10:P648)/O648","v":0.59780907668231609},3.1390639691047824]
[11.965921546622207,6.5762489169284173,6.5762489169284173,15.467836907654029,22.044085824582446,null,null,null,null,5,4.9949053188260191,15,24.994905318826021,null,640,1,{"$f":"SUM(P$10:P649)/O649","v":0.59843749999999996},-2.950819494243575]
[{"$f":"A$7+RAND()*A$8","v":14.468686109105066},15.68369448336405,{"$f":"MIN(A650:B650)","v":14.468686109105066},{"$f":"D$7+RAND()*D$8","v":14.445481371032781},{"$f":"D650+C650","v":28.914167480137849},null,null,null,null,5,{"$f":"K$7+RAND()*K$8","v":2.9269684458248353},15,{"$f":"L650+K650+J650","v":22.926968445824834},null,641,{"$f":"(E650<M650)*1","v":0},{"$f":"SUM(P$10:P650)/O650","v":0.5975039001560063},{"$f":"E650-M650","v":5.987199034313015}]
[5.4249256101207237,2.3779764246157598,2.3779764246157598,13.636408330320364,16.014384754936124,null,null,null,null,5,8.7628171163834367E-2,15,20.087628171163836,null,{"$f":"O650+1","v":642},1,{"$f":"SUM(P$10:P651)/O651","v":0.59813084112149528},-4.0732434162277116]
[11.180368585646725,8.7146064713873539,8.7146064713873539,13.033006100638559,21.747612572025915,null,null,null,null,5,3.679582840852639,15,23.679582840852639,null,643,1,{"$f":"SUM(P$10:P652)/O652","v":0.59875583203732508},-1.9319702688267242]
[3.2499032801613148,19.687559908888609,3.2499032801613148,12.29050531443073,15.540408594592044,null,null,null,null,5,2.3358871383104391,15,22.33588713831044,null,644,1,{"$f":"SUM(P$10:P653)/O653","v":0.59937888198757761},-6.7954785437183958]
[19.37015824332391,15.900312288146758,15.900312288146758,14.735927171220974,30.636239459367729,null,null,null,null,5,2.5315107782500705,15,22.53151077825007,null,645,0,{"$f":"SUM(P$10:P654)/O654","v":0.59844961240310079},8.1047286811176598]
[14.565868891416523,19.715048494403639,14.565868891416523,12.481367140077577,27.047236031494101,null,null,null,null,5,1.6918522866574133,15,21.691852286657415,null,646,0,{"$f":"SUM(P$10:P655)/O655","v":0.5975232198142415},5.3553837448366863]
[2.5898198440343689,4.711535890529106,2.5898198440343689,16.337577331598393,18.927397175632763,null,null,null,null,5,2.4625741327093102,15,22.46257413270931,null,647,1,{"$f":"SUM(P$10:P656)/O656","v":0.59814528593508498},-3.5351769570765477]
[16.92308323142565,5.5016755669113966,5.5016755669113966,15.399072001329095,20.90074756824049,null,null,null,null,5,2.2771222439176491,15,22.277122243917649,null,648,1,{"$f":"SUM(P$10:P657)/O657","v":0.59876543209876543},-1.3763746756771589]
[7.5214869589352906,6.3922600834884769,6.3922600834884769,15.478197544587514,21.870457628075989,null,null,null,null,5,0.66924062038304089,15,20.669240620383043,null,649,0,{"$f":"SUM(P$10:P658)/O658","v":0.5978428351309707},1.2012170076929465]
[2.5824553248332349,7.3171187077567819,2.5824553248332349,13.757483501975583,16.339938826808819,null,null,null,null,5,3.1604418966510401,15,23.16044189665104,null,650,1,{"$f":"SUM(P$10:P659)/O659","v":0.59846153846153849},-6.8205030698422213]
[0.92547690105851954,7.6164579045288994,0.92547690105851954,13.495125294227313,14.420602195285833,null,null,null,null,5,4.9536276288997438,15,24.953627628899746,null,651,1,{"$f":"SUM(P$10:P660)/O660","v":0.59907834101382484},-10.533025433613913]
[11.814433586189812,12.22022676254149,11.814433586189812,16.189626461190691,28.004060047380506,null,null,null,null,5,0.79543270243219777,15,20.795432702432198,null,652,0,{"$f":"SUM(P$10:P661)/O661","v":0.59815950920245398},7.208627344948308]
[11.260078226649807,0.11686136250626866,0.11686136250626866,13.168725968044747,13.285587330551015,null,null,null,null,5,0.91426381180337302,15,20.914263811803373,null,653,1,{"$f":"SUM(P$10:P662)/O662","v":0.59877488514548238},-7.6286764812523575]
[9.1649066318784094,19.795380863512662,9.1649066318784094,16.241869944083952,25.406776575962361,null,null,null,null,5,0.46284140527094675,15,20.462841405270947,null,654,0,{"$f":"SUM(P$10:P663)/O663","v":0.59785932721712542},4.9439351706914145]
[8.8491537844891397,19.472158168540744,8.8491537844891397,16.451314310463989,25.300468094953128,null,null,null,null,5,3.4585460622077835,15,23.458546062207784,null,655,0,{"$f":"SUM(P$10:P664)/O664","v":0.59694656488549613},1.8419220327453445]
[19.866592773660482,10.379531567264761,10.379531567264761,14.402589858659304,24.782121425924068,null,null,null,null,5,4.3649488332893274,15,24.364948833289326,null,656,0,{"$f":"SUM(P$10:P665)/O665","v":0.59603658536585369},0.41717259263474205]
[1.9023081360582306,14.826588699622603,1.9023081360582306,12.602931175644102,14.505239311702333,null,null,null,null,5,0.73626092987406022,15,20.73626092987406,null,657,1,{"$f":"SUM(P$10:P666)/O666","v":0.59665144596651443},-6.2310216181717273]
[13.013394615977186,2.3950162865076585,2.3950162865076585,17.628781312175633,20.023797598683291,null,null,null,null,5,0.98330021904812437,15,20.983300219048125,null,658,1,{"$f":"SUM(P$10:P667)/O667","v":0.59726443768996962},-0.9595026203648338]
[12.294520646640425,6.0775653575680888,6.0775653575680888,17.568999807845465,23.646565165413556,null,null,null,null,5,3.4421193228292948,15,23.442119322829296,null,659,0,{"$f":"SUM(P$10:P668)/O668","v":0.59635811836115327},0.20444584258425991]
[18.936340723014979,4.7259475939646052,4.7259475939646052,14.949074079489463,19.675021673454069,null,null,null,null,5,1.1344537625672109,15,21.134453762567212,null,660,1,{"$f":"SUM(P$10:P669)/O669","v":0.59696969696969693},-1.4594320891131431]
[{"$f":"A$7+RAND()*A$8","v":11.825491899086432},11.814899565545554,11.814899565545554,12.28383329296615,24.098732858511703,null,null,null,null,5,0.6714522625781888,15,20.671452262578189,null,661,0,{"$f":"SUM(P$10:P670)/O670","v":0.59606656580937978},3.4272805959335138]
[7.908823402586858,7.9056045145676368,7.9056045145676368,16.633703961622256,24.539308476189895,null,null,null,null,5,2.6650161896845463,15,22.665016189684547,null,662,0,{"$f":"SUM(P$10:P671)/O671","v":0.595166163141994},1.874292286505348]
[18.640882345245217,1.0982329317354766,1.0982329317354766,17.842929920722284,18.941162852457762,null,null,null,null,5,3.6850885638919726,15,23.685088563891973,null,663,1,{"$f":"SUM(P$10:P672)/O672","v":0.59577677224736048},-4.7439257114342119]
[4.2179205014806271,6.0489525853066102,4.2179205014806271,16.82536981050059,21.043290311981217,null,null,null,null,5,3.3634811815229781,15,23.363481181522978,null,664,1,{"$f":"SUM(P$10:P673)/O673","v":0.59638554216867468},-2.3201908695417615]
[10.784440770320444,15.438294361180544,10.784440770320444,17.042897163255653,27.827337933576096,null,null,null,null,5,3.4143413290658891,15,23.414341329065888,null,665,0,{"$f":"SUM(P$10:P674)/O674","v":0.59548872180451129},4.4129966045102087]
[3.0668350236716768,9.3700675350643472,3.0668350236716768,14.479225814950151,17.546060838621827,null,null,null,null,5,3.280082861466199,15,23.280082861466198,null,666,1,{"$f":"SUM(P$10:P675)/O675","v":0.59609609609609615},-5.7340220228443712]
[8.3818205654937259,13.994258273243918,8.3818205654937259,15.016652176082832,23.398472741576558,null,null,null,null,5,1.9007648846320147,15,21.900764884632014,null,667,0,{"$f":"SUM(P$10:P676)/O676","v":0.59520239880059966},1.4977078569445439]
[2.0694050157805233,14.476648038563631,2.0694050157805233,17.011230545230681,19.080635561011206,null,null,null,null,5,4.9610063145898273,15,24.961006314589827,null,668,1,{"$f":"SUM(P$10:P677)/O677","v":0.59580838323353291},-5.8803707535786209]
[19.648105852081219,13.517928246219366,13.517928246219366,13.432995090580404,26.950923336799768,null,null,null,null,5,2.6057985066366021,15,22.605798506636603,null,669,0,{"$f":"SUM(P$10:P678)/O678","v":0.59491778774289983},4.3451248301631651]
[15.370584973467789,17.320698288064232,15.370584973467789,15.809321430973704,31.179906404441493,null,null,null,null,5,4.0622400975618502,15,24.062240097561851,null,670,0,{"$f":"SUM(P$10:P679)/O679","v":0.59402985074626868},7.1176663068796415]
[9.3847976412509411,11.873034225021685,9.3847976412509411,13.50708272293345,22.891880364184392,null,null,null,null,5,2.4430463063544572,15,22.443046306354457,null,671,0,{"$f":"SUM(P$10:P680)/O680","v":0.59314456035767515},0.44883405782993435]
[17.083751172156589,2.4949525782936099,2.4949525782936099,17.980301326813144,20.475253905106754,null,null,null,null,5,4.6012473206302413,15,24.601247320630243,null,672,1,{"$f":"SUM(P$10:P681)/O681","v":0.59375},-4.1259934155234887]
[18.663446484782494,12.639605749154057,12.639605749154057,14.114035368581858,26.753641117735917,null,null,null,null,5,1.8595187328195868,15,21.859518732819588,null,673,0,{"$f":"SUM(P$10:P682)/O682","v":0.59286775631500743},4.8941223849163293]
[6.2843091707329073,15.752964351120422,6.2843091707329073,14.415529673424359,20.699838844157266,null,null,null,null,5,2.7382983303319723,15,22.738298330331972,null,674,1,{"$f":"SUM(P$10:P683)/O683","v":0.59347181008902072},-2.0384594861747054]
[2.046802766008724,6.8155458474699397,2.046802766008724,13.777046232192397,15.823848998201122,null,null,null,null,5,0.11530950133160245,15,20.115309501331602,null,675,1,{"$f":"SUM(P$10:P684)/O684","v":0.59407407407407409},-4.2914605031304802]
[13.571982000114883,3.828500954434515,3.828500954434515,13.573676529565628,17.402177484000141,null,null,null,null,5,0.18395305556837049,15,20.18395305556837,null,676,1,{"$f":"SUM(P$10:P685)/O685","v":0.59467455621301779},-2.7817755715682289]
[19.154145474815245,14.157539832048634,14.157539832048634,14.152540505475228,28.310080337523864,null,null,null,null,5,0.38339513483642729,15,20.383395134836427,null,677,0,{"$f":"SUM(P$10:P686)/O686","v":0.59379615952732645},7.9266852026874375]
[7.5590595623830836,10.615295303661853,7.5590595623830836,13.636042370262842,21.195101932645926,null,null,null,null,5,1.388755661779475,15,21.388755661779474,null,678,1,{"$f":"SUM(P$10:P687)/O687","v":0.5943952802359882},-0.19365372913354761]
[1.0354094579782513,4.8788104362950406,1.0354094579782513,14.386116040492389,15.42152549847064,null,null,null,null,5,3.2454605469053543,15,23.245460546905356,null,679,1,{"$f":"SUM(P$10:P688)/O688","v":0.59499263622974963},-7.8239350484347163]
[14.682610729820336,6.4695697272994508,6.4695697272994508,15.132543216004873,21.602112943304324,null,null,null,null,5,1.0026953493127688,15,21.00269534931277,null,680,0,{"$f":"SUM(P$10:P689)/O689","v":0.59411764705882353},0.59941759399155359]
[{"$f":"A$7+RAND()*A$8","v":7.5473058445545487},15.975843246039027,7.5473058445545487,14.359169444476873,21.90647528903142,null,null,null,null,5,0.29095857750391363,15,20.290958577503915,null,681,0,{"$f":"SUM(P$10:P690)/O690","v":0.59324522760646103},1.6155167115275049]
[12.602671781029123,5.8396600636985152E-2,5.8396600636985152E-2,17.893791250690633,17.952187851327619,null,null,null,null,5,4.8094862525828663,15,24.809486252582865,null,682,1,{"$f":"SUM(P$10:P691)/O691","v":0.59384164222873903},-6.857298401255246]
[11.491624210597147,5.4620609610220843,5.4620609610220843,12.359244710759803,17.821305671781886,null,null,null,null,5,3.314208266577543,15,23.314208266577545,null,683,1,{"$f":"SUM(P$10:P692)/O692","v":0.59443631039531475},-5.4929025947956589]
[12.906540460912023,4.7115856999837868,4.7115856999837868,16.578405338497305,21.289991038481091,null,null,null,null,5,4.4419927822561469,15,24.441992782256147,null,684,1,{"$f":"SUM(P$10:P693)/O693","v":0.59502923976608191},-3.152001743775056]
[16.316810094285071,2.8567945753850355,2.8567945753850355,15.318280272462344,18.17507484784738,null,null,null,null,5,3.804331720931831,15,23.804331720931831,null,685,1,{"$f":"SUM(P$10:P694)/O694","v":0.59562043795620434},-5.6292568730844508]
[0.63999475593582655,13.250579930250998,0.63999475593582655,16.323839959977811,16.963834715913638,null,null,null,null,5,8.8235099435629016E-2,15,20.088235099435629,null,686,1,{"$f":"SUM(P$10:P695)/O695","v":0.59620991253644318},-3.1244003835219907]
[5.0180466025205206,0.44267925874006631,0.44267925874006631,15.802048198692258,16.244727457432326,null,null,null,null,5,2.4340235714056884,15,22.434023571405689,null,687,1,{"$f":"SUM(P$10:P696)/O696","v":0.59679767103347892},-6.1892961139733629]
[1.3174422782354234,10.630558235237853,1.3174422782354234,17.662688216722501,18.980130494957923,null,null,null,null,5,4.9050080990688496,15,24.905008099068851,null,688,1,{"$f":"SUM(P$10:P697)/O697","v":0.59738372093023251},-5.9248776041109288]
[13.801850859064677,9.4493756470459989,9.4493756470459989,15.893685636830554,25.343061283876551,null,null,null,null,5,2.5209738766555452,15,22.520973876655546,null,689,0,{"$f":"SUM(P$10:P698)/O698","v":0.59651669085631354},2.8220874072210052]
[17.000989870149713,4.5088838477964055,4.5088838477964055,12.450491373136442,16.959375220932849,null,null,null,null,5,3.7902445137260523,15,23.790244513726051,null,690,1,{"$f":"SUM(P$10:P699)/O699","v":0.59710144927536235},-6.8308692927932029]
[0.29007065044486247,7.4089938943345679,0.29007065044486247,17.390663095395251,17.680733745840115,null,null,null,null,5,2.6844380049465366,15,22.684438004946536,null,691,1,{"$f":"SUM(P$10:P700)/O700","v":0.59768451519536903},-5.0037042591064207]
[9.1808482086779275E-2,18.965920260592227,9.1808482086779275E-2,12.410589427706089,12.502397909792869,null,null,null,null,5,0.2857852527450605,15,20.285785252745061,null,692,1,{"$f":"SUM(P$10:P701)/O701","v":0.59826589595375723},-7.7833873429521923]
[18.366585569491921,3.1600286952920342,3.1600286952920342,17.48004476255359,20.640073457845624,null,null,null,null,5,1.0722296363238519,15,21.072229636323851,null,693,1,{"$f":"SUM(P$10:P702)/O702","v":0.59884559884559885},-0.43215617847822685]
[4.6556945043902882,10.514153830169102,4.6556945043902882,14.457691636453308,19.113386140843595,null,null,null,null,5,1.3938969422710035,15,21.393896942271002,null,694,1,{"$f":"SUM(P$10:P703)/O703","v":0.59942363112391928},-2.2805108014274076]
[4.6212468445764348,18.585804845623883,4.6212468445764348,16.332213884634676,20.953460729211109,null,null,null,null,5,4.5190840977595164,15,24.519084097759517,null,695,1,{"$f":"SUM(P$10:P704)/O704","v":0.6},-3.5656233685484082]
[11.380365166630142,6.6955939468725933,6.6955939468725933,17.839987522194086,24.535581469066678,null,null,null,null,5,1.3401772559619536,15,21.340177255961954,null,696,0,{"$f":"SUM(P$10:P705)/O705","v":0.59913793103448276},3.1954042131047231]
[8.7104332547913881,10.471075465825443,8.7104332547913881,16.070873077576067,24.781306332367457,null,null,null,null,5,3.5915934233477653,15,23.591593423347767,null,697,0,{"$f":"SUM(P$10:P706)/O706","v":0.59827833572453371},1.1897129090196898]
[17.859690800787064,9.433304474233374,9.433304474233374,17.752287607998845,27.185592082232219,null,null,null,null,5,4.4224966071146854,15,24.422496607114685,null,698,0,{"$f":"SUM(P$10:P707)/O707","v":0.59742120343839544},2.7630954751175345]
[13.788319004464753,3.8478547448591027,3.8478547448591027,17.402191409780801,21.250046154639904,null,null,null,null,5,2.9064609870472582,15,22.906460987047257,null,699,1,{"$f":"SUM(P$10:P708)/O708","v":0.59799713876967098},-1.6564148324073535]
[8.5217172210088243,5.4512605253831588,5.4512605253831588,15.295323724171244,20.746584249554402,null,null,null,null,5,3.0193857996774183,15,23.019385799677419,null,700,1,{"$f":"SUM(P$10:P709)/O709","v":0.59857142857142853},-2.2728015501230168]
[{"$f":"A$7+RAND()*A$8","v":15.874758468305625},2.6871677899260993,2.6871677899260993,15.919673515004165,18.606841304930263,null,null,null,null,5,4.9278154753686678,15,24.927815475368668,null,701,1,{"$f":"SUM(P$10:P710)/O710","v":0.59914407988587737},-6.3209741704384044]
[6.2300201615868449,17.189512115879758,6.2300201615868449,16.875906084089394,23.105926245676237,null,null,null,null,5,0.32958208094422015,15,20.32958208094422,null,702,0,{"$f":"SUM(P$10:P711)/O711","v":0.59829059829059827},2.7763441647320164]
[18.364846335234432,10.332562659608659,10.332562659608659,17.671922242492357,28.004484902101016,null,null,null,null,5,1.7221080477788648,15,21.722108047778864,null,703,0,{"$f":"SUM(P$10:P712)/O712","v":0.59743954480796591},6.2823768543221519]
[9.2408942384215926,18.866500825904133,9.2408942384215926,17.254873787067837,26.495768025489429,null,null,null,null,5,0.25607634226603726,15,20.256076342266038,null,704,0,{"$f":"SUM(P$10:P713)/O713","v":0.59659090909090906},6.2396916832233913]
[2.3731818715309116,9.2405091508392267,{"$f":"MIN(A714:B714)","v":2.3731818715309116},{"$f":"D$7+RAND()*D$8","v":15.124386385942223},{"$f":"D714+C714","v":17.497568257473134},null,null,null,null,5,{"$f":"K$7+RAND()*K$8","v":2.0241231085508069},15,{"$f":"L714+K714+J714","v":22.024123108550807},null,705,{"$f":"(E714<M714)*1","v":1},{"$f":"SUM(P$10:P714)/O714","v":0.59716312056737586},{"$f":"E714-M714","v":-4.5265548510776732}]
[2.0338318779420095,15.641086875439127,2.0338318779420095,15.443959414174362,17.477791292116372,null,null,null,null,5,2.2398437614402518,15,22.239843761440252,null,{"$f":"O714+1","v":706},1,{"$f":"SUM(P$10:P715)/O715","v":0.59773371104815864},-4.7620524693238799]
[10.173825420712205,13.5969524483298,10.173825420712205,17.46717230219749,27.640997722909695,null,null,null,null,5,1.7258963067362687,15,21.725896306736267,null,707,0,{"$f":"SUM(P$10:P716)/O716","v":0.59688826025459685},5.9151014161734281]
[1.838339524488668,18.704003630400244,1.838339524488668,13.361150841856221,15.199490366344889,null,null,null,null,5,3.8797013438140415,15,23.879701343814041,null,708,1,{"$f":"SUM(P$10:P717)/O717","v":0.59745762711864403},-8.6802109774691516]
[10.267184060194856,4.0489875135614,4.0489875135614,14.613271427683678,18.662258941245078,null,null,null,null,5,1.8364061294363931,15,21.836406129436394,null,709,1,{"$f":"SUM(P$10:P718)/O718","v":0.59802538787023973},-3.1741471881913164]
[2.2997722604074777,3.5814480011583538,2.2997722604074777,16.825790391289161,19.12556265169664,null,null,null,null,5,4.8351590323658025,15,24.835159032365802,null,710,1,{"$f":"SUM(P$10:P719)/O719","v":0.59859154929577463},-5.7095963806691614]
[17.853802093079103,14.309116361063804,14.309116361063804,17.198781403600389,31.507897764664193,null,null,null,null,5,2.347501091615448,15,22.347501091615449,null,711,0,{"$f":"SUM(P$10:P720)/O720","v":0.59774964838255973},9.1603966730487443]
[6.2631682938055278,8.9787672894648569,6.2631682938055278,17.218495504280384,23.481663798085911,null,null,null,null,5,3.1642141643327926,15,23.164214164332794,null,712,0,{"$f":"SUM(P$10:P721)/O721","v":0.5969101123595506},0.31744963375311741]
[11.846951094313917,11.987032963333736,11.846951094313917,12.48746425733475,24.334415351648666,null,null,null,null,5,2.0999043944589229,15,22.099904394458925,null,713,0,{"$f":"SUM(P$10:P722)/O722","v":0.59607293127629735},2.234510957189741]
[1.4291783759210763,18.499715524095002,1.4291783759210763,15.412269753006594,16.84144812892767,null,null,null,null,5,1.803033518606314,15,21.803033518606313,null,714,1,{"$f":"SUM(P$10:P723)/O723","v":0.59663865546218486},-4.9615853896786426]
[6.9147189271315241,5.6848501915336147,5.6848501915336147,12.58803693416813,18.272887125701743,null,null,null,null,5,4.0888342832315487,15,24.088834283231549,null,715,1,{"$f":"SUM(P$10:P724)/O724","v":0.59720279720279723},-5.8159471575298056]
[3.8617452611916692,15.544954076870381,3.8617452611916692,15.7361480733333,19.597893334524969,null,null,null,null,5,0.25625531007233193,15,20.256255310072333,null,716,1,{"$f":"SUM(P$10:P725)/O725","v":0.5977653631284916},-0.65836197554736486]
[6.2983316289282225,4.5896301637292751,4.5896301637292751,13.471804373132008,18.061434536861285,null,null,null,null,5,3.8206516839907061,15,23.820651683990707,null,717,1,{"$f":"SUM(P$10:P726)/O726","v":0.59832635983263593},-5.7592171471294229]
[18.356605533650434,18.017532766466129,18.017532766466129,12.510920506345581,30.52845327281171,null,null,null,null,5,1.4276268340118619,15,21.427626834011861,null,718,0,{"$f":"SUM(P$10:P727)/O727","v":0.59749303621169914},9.1008264387998494]
[7.6249706307250831,15.960631395797172,7.6249706307250831,12.321019319633622,19.945989950358705,null,null,null,null,5,2.0633846351257192,15,22.063384635125718,null,719,1,{"$f":"SUM(P$10:P728)/O728","v":0.59805285118219753},-2.1173946847670138]
[11.48826705513607,4.0959460857477969,4.0959460857477969,17.095760340486635,21.191706426234433,null,null,null,null,5,3.310519619535266,15,23.310519619535267,null,720,1,{"$f":"SUM(P$10:P729)/O729","v":0.59861111111111109},-2.1188131933008343]
[{"$f":"A$7+RAND()*A$8","v":10.720338427207848},17.162754166305156,10.720338427207848,16.83946082916933,27.559799256377175,null,null,null,null,5,4.1067701727139667,15,24.106770172713965,null,721,0,{"$f":"SUM(P$10:P730)/O730","v":0.5977808599167822},3.4530290836632105]
[19.85927713022344,6.3976578873367789,6.3976578873367789,17.29269979821008,23.690357685546857,null,null,null,null,5,0.39965176757995657,15,20.399651767579957,null,722,0,{"$f":"SUM(P$10:P731)/O731","v":0.59695290858725758},3.2907059179668998]
[0.10847770949153901,18.535109182754535,0.10847770949153901,16.938839066361766,17.047316775853304,null,null,null,null,5,4.6534720686644064,15,24.653472068664406,null,723,1,{"$f":"SUM(P$10:P732)/O732","v":0.59751037344398339},-7.6061552928111027]
[9.4354728111806487,15.136184267957812,9.4354728111806487,13.566602475909587,23.002075287090236,null,null,null,null,5,0.47049371941842388,15,20.470493719418425,null,724,0,{"$f":"SUM(P$10:P733)/O733","v":0.59668508287292821},2.531581567671811]
[4.0017694771356771,18.446499713861158,4.0017694771356771,15.242434362827694,19.244203839963372,null,null,null,null,5,0.76481011246562369,15,20.764810112465625,null,725,1,{"$f":"SUM(P$10:P734)/O734","v":0.59724137931034482},-1.5206062725022527]
[11.992540958407323,14.900432817726113,11.992540958407323,16.779320199192625,28.77186115759995,null,null,null,null,5,1.8962388503298162,15,21.896238850329816,null,726,0,{"$f":"SUM(P$10:P735)/O735","v":0.59641873278236912},6.8756223072701346]
[13.583379537247733,17.402421883148804,13.583379537247733,12.907306415495205,26.490685952742936,null,null,null,null,5,4.4357628985314301,15,24.435762898531429,null,727,0,{"$f":"SUM(P$10:P736)/O736","v":0.59559834938101786},2.0549230542115069]
[3.7410931256752167,0.68446625147446705,0.68446625147446705,13.30541303008048,13.989879281554947,null,null,null,null,5,1.365648379740239,15,21.365648379740239,null,728,1,{"$f":"SUM(P$10:P737)/O737","v":0.59615384615384615},-7.3757690981852928]
[6.198664161295353,6.1960813226518567,6.1960813226518567,13.814803632619142,20.010884955270999,null,null,null,null,5,1.6905527897695554,15,21.690552789769555,null,729,1,{"$f":"SUM(P$10:P738)/O738","v":0.5967078189300411},-1.6796678344985558]
[5.5348329931918556,5.0869353530098005,5.0869353530098005,17.537762573179982,22.624697926189782,null,null,null,null,5,2.362256009496293,15,22.362256009496292,null,730,0,{"$f":"SUM(P$10:P739)/O739","v":0.59589041095890416},0.26244191669348993]
[13.99126229907858,14.567208121401205,13.99126229907858,12.044551407170408,26.035813706248987,null,null,null,null,5,4.7676840468215786,15,24.767684046821579,null,731,0,{"$f":"SUM(P$10:P740)/O740","v":0.59507523939808482},1.2681296594274087]
[5.0652352027961989,6.410604661786965,5.0652352027961989,16.941582065227387,22.006817268023585,null,null,null,null,5,2.7237629804958252,15,22.723762980495824,null,732,1,{"$f":"SUM(P$10:P741)/O741","v":0.59562841530054644},-0.71694571247223848]
[13.589362601962334,17.85329228913519,13.589362601962334,15.111850214267305,28.701212816229638,null,null,null,null,5,3.9814089039454266,15,23.981408903945425,null,733,0,{"$f":"SUM(P$10:P742)/O742","v":0.59481582537517053},4.7198039122842133]
[18.403349291220152,16.601157545193704,16.601157545193704,12.270852948579671,28.872010493773374,null,null,null,null,5,1.991588623211304,15,21.991588623211303,null,734,0,{"$f":"SUM(P$10:P743)/O743","v":0.59400544959128065},6.8804218705620706]
[5.7213774794493011,11.100874337517457,5.7213774794493011,13.432320377554918,19.153697857004218,null,null,null,null,5,0.85868265906723418,15,20.858682659067235,null,735,1,{"$f":"SUM(P$10:P744)/O744","v":0.59455782312925165},-1.7049848020630165]
[1.162636346304009,7.9493798614936058,1.162636346304009,17.926892905199814,19.089529251503823,null,null,null,null,5,4.8794485881330436,15,24.879448588133044,null,736,1,{"$f":"SUM(P$10:P745)/O745","v":0.59510869565217395},-5.7899193366292216]
[11.926936694701073,19.968620418715769,11.926936694701073,14.855344185594923,26.782280880295996,null,null,null,null,5,2.1519909253241467,15,22.151990925324146,null,737,0,{"$f":"SUM(P$10:P746)/O746","v":0.59430122116689277},4.6302899549718504]
[2.2661043623280053,8.857248013419996,2.2661043623280053,16.835321403063634,19.101425765391639,null,null,null,null,5,2.6776278552952641,15,22.677627855295263,null,738,1,{"$f":"SUM(P$10:P747)/O747","v":0.59485094850948506},-3.5762020899036244]
[14.816840041290046,18.220868465678645,14.816840041290046,14.029059778002878,28.845899819292924,null,null,null,null,5,4.8694640942930842,15,24.869464094293086,null,739,0,{"$f":"SUM(P$10:P748)/O748","v":0.59404600811907982},3.9764357249998383]
[10.841733365141108,19.537856912628015,10.841733365141108,15.919365516878127,26.761098882019233,null,null,null,null,5,2.8574797059091726,15,22.857479705909171,null,740,0,{"$f":"SUM(P$10:P749)/O749","v":0.59324324324324329},3.9036191761100625]
[{"$f":"A$7+RAND()*A$8","v":9.0640190367968536},14.939775071383076,9.0640190367968536,16.576293173163158,25.640312209960012,null,null,null,null,5,3.152815137988445,15,23.152815137988444,null,741,0,{"$f":"SUM(P$10:P750)/O750","v":0.59244264507422406},2.4874970719715677]
[13.361903906418215,15.977796761543297,13.361903906418215,17.559024525436442,30.920928431854655,null,null,null,null,5,0.14180800190445708,15,20.141808001904458,null,742,0,{"$f":"SUM(P$10:P751)/O751","v":0.59164420485175206},10.779120429950197]
[0.22934858768701272,8.5706011597512166,0.22934858768701272,16.90463771458975,17.133986302276764,null,null,null,null,5,0.66008959872386419,15,20.660089598723864,null,743,1,{"$f":"SUM(P$10:P752)/O752","v":0.59219380888290718},-3.5261032964471006]
[16.650648623107664,5.6817832435722675,5.6817832435722675,12.302396712354941,17.98417995592721,null,null,null,null,5,0.78574370451075293,15,20.785743704510754,null,744,1,{"$f":"SUM(P$10:P753)/O753","v":0.592741935483871},-2.8015637485835434]
[8.2415409246992866,15.751019197129136,8.2415409246992866,14.719888560171784,22.961429484871068,null,null,null,null,5,1.1706318233649216,15,21.170631823364921,null,745,0,{"$f":"SUM(P$10:P754)/O754","v":0.59194630872483223},1.7907976615061472]
[4.2203439930953346,19.953371783926556,4.2203439930953346,12.51279752320338,16.733141516298716,null,null,null,null,5,2.9866176711045829,15,22.986617671104582,null,746,1,{"$f":"SUM(P$10:P755)/O755","v":0.59249329758713132},-6.2534761548058668]
[7.4479046283930668,16.752598752294354,7.4479046283930668,12.849363974950812,20.29726860334388,null,null,null,null,5,0.2832994231822078,15,20.283299423182207,null,747,0,{"$f":"SUM(P$10:P756)/O756","v":0.5917001338688086},1.3969180161673478E-2]
[5.5497469889015338,7.7269770599161625,5.5497469889015338,12.883345527464154,18.43309251636569,null,null,null,null,5,3.64893749728828,15,23.64893749728828,null,748,1,{"$f":"SUM(P$10:P757)/O757","v":0.59224598930481287},-5.21584498092259]
[16.137673857110016,16.195540509771941,16.137673857110016,13.281186020111983,29.418859877221998,null,null,null,null,5,4.459175231290204,15,24.459175231290203,null,749,0,{"$f":"SUM(P$10:P758)/O758","v":0.59145527369826434},4.9596846459317945]
[2.96825088172882,2.7212926672341498,2.7212926672341498,17.857894271999221,20.57918693923337,null,null,null,null,5,1.1591367212217412,15,21.159136721221742,null,750,1,{"$f":"SUM(P$10:P759)/O759","v":0.59199999999999997},-0.57994978198837188]
[3.6465576612433059,16.743883571809121,3.6465576612433059,14.68420458368993,18.330762244933236,null,null,null,null,5,2.4221132578631046,15,22.422113257863103,null,751,1,{"$f":"SUM(P$10:P760)/O760","v":0.59254327563248999},-4.0913510129298665]
[12.9254060621272,18.66414258163968,12.9254060621272,15.574040674169439,28.49944673629664,null,null,null,null,5,3.7362251112152127,15,23.736225111215212,null,752,0,{"$f":"SUM(P$10:P761)/O761","v":0.5917553191489362},4.7632216250814281]
[5.8097588522879366,10.043344169483433,5.8097588522879366,14.421677715879348,20.231436568167283,null,null,null,null,5,0.5913278309364095,15,20.591327830936407,null,753,1,{"$f":"SUM(P$10:P762)/O762","v":0.59229747675962818},-0.35989126276912486]
[5.503511135240478,19.121891921719133,5.503511135240478,13.879821041377658,19.383332176618136,null,null,null,null,5,3.4425710958577764,15,23.442571095857776,null,754,1,{"$f":"SUM(P$10:P763)/O763","v":0.59283819628647216},-4.0592389192396396]
[13.245058192699625,12.513171320723961,12.513171320723961,13.210707153923407,25.723878474647368,null,null,null,null,5,4.6502004301769979,15,24.650200430176998,null,755,0,{"$f":"SUM(P$10:P764)/O764","v":0.59205298013245033},1.0736780444703697]
[15.311902189548942,5.4522438012318304,5.4522438012318304,17.110331593517653,22.562575394749484,null,null,null,null,5,2.1752251218411214,15,22.175225121841123,null,756,0,{"$f":"SUM(P$10:P765)/O765","v":0.59126984126984128},0.38735027290836044]
[13.607608705966863,5.8906416772438526,5.8906416772438526,16.760037008779126,22.650678686022978,null,null,null,null,5,3.5219923452632083,15,23.521992345263207,null,757,1,{"$f":"SUM(P$10:P766)/O766","v":0.59180977542932633},-0.8713136592402293]
[15.717737768890167,18.047115685359937,15.717737768890167,14.21432310665471,29.932060875544877,null,null,null,null,5,1.1150752410971125,15,21.115075241097113,null,758,0,{"$f":"SUM(P$10:P767)/O767","v":0.59102902374670185},8.8169856344477644]
[12.004834817981575,13.054830714964066,12.004834817981575,17.066666129922712,29.071500947904287,null,null,null,null,5,2.4514905622567973,15,22.451490562256797,null,759,0,{"$f":"SUM(P$10:P768)/O768","v":0.59025032938076416},6.6200103856474897]
[3.7652825895012065,16.724610091201953,3.7652825895012065,17.632620721548747,21.397903311049955,null,null,null,null,5,4.0510732496622932,15,24.051073249662295,null,760,1,{"$f":"SUM(P$10:P769)/O769","v":0.59078947368421053},-2.65316993861234]
[{"$f":"A$7+RAND()*A$8","v":16.721354820634172},16.714610863662791,16.714610863662791,14.843158922155968,31.55776978581876,null,null,null,null,5,0.99998120164249915,15,20.999981201642498,null,761,0,{"$f":"SUM(P$10:P770)/O770","v":0.59001314060446786},10.557788584176262]
[7.9088694822291856,15.015774085621043,7.9088694822291856,14.481178957325007,22.390048439554192,null,null,null,null,5,4.825929624595334,15,24.825929624595332,null,762,1,{"$f":"SUM(P$10:P771)/O771","v":0.59055118110236215},-2.4358811850411399]
[11.885811451673874,9.9650841886983859,9.9650841886983859,12.428470400005088,22.393554588703473,null,null,null,null,5,2.3308872399903047,15,22.330887239990304,null,763,0,{"$f":"SUM(P$10:P772)/O772","v":0.58977719528178241},6.2667348713169702E-2]
[11.515666485703719,4.0465246682729461,4.0465246682729461,14.872380403797223,18.918905072070167,null,null,null,null,5,2.3336012804526378,15,22.333601280452637,null,764,1,{"$f":"SUM(P$10:P773)/O773","v":0.59031413612565442},-3.4146962083824697]
[10.196202928729132,14.265437604189925,10.196202928729132,13.90946851761316,24.105671446342292,null,null,null,null,5,4.3867145547272299,15,24.386714554727231,null,765,1,{"$f":"SUM(P$10:P774)/O774","v":0.59084967320261439},-0.28104310838493873]
[2.0155622522350991,12.007433864254097,2.0155622522350991,12.774028302066702,14.789590554301801,null,null,null,null,5,4.8738171751315109,15,24.87381717513151,null,766,1,{"$f":"SUM(P$10:P775)/O775","v":0.59138381201044388},-10.084226620829709]
[11.510019754524253,16.029190497581535,11.510019754524253,12.969311087219637,24.479330841743888,null,null,null,null,5,1.5082380024676911,15,21.508238002467692,null,767,0,{"$f":"SUM(P$10:P776)/O776","v":0.59061277705345505},2.9710928392761957]
[6.7067426856590062,2.3579626151650901,2.3579626151650901,17.290240714320316,19.648203329485405,null,null,null,null,5,1.1597807139732614,15,21.159780713973262,null,768,1,{"$f":"SUM(P$10:P777)/O777","v":0.59114583333333337},-1.5115773844878575]
[18.107592546505476,0.27729652727709109,{"$f":"MIN(A778:B778)","v":0.27729652727709109},{"$f":"D$7+RAND()*D$8","v":12.111026286537356},{"$f":"D778+C778","v":12.388322813814447},null,null,null,null,5,{"$f":"K$7+RAND()*K$8","v":4.2439240498435984},15,{"$f":"L778+K778+J778","v":24.243924049843599},null,769,{"$f":"(E778<M778)*1","v":1},{"$f":"SUM(P$10:P778)/O778","v":0.59167750325097535},{"$f":"E778-M778","v":-11.855601236029152}]
[5.9530474310621102,10.311541312688528,5.9530474310621102,16.765749513697237,22.718796944759347,null,null,null,null,5,0.62439538301114816,15,20.624395383011148,null,{"$f":"O778+1","v":770},0,{"$f":"SUM(P$10:P779)/O779","v":0.59090909090909094},2.0944015617481995]
[7.1836084266876306,19.228394492154983,7.1836084266876306,13.126277256170113,20.309885682857743,null,null,null,null,5,2.0846179729915528,15,22.084617972991552,null,771,1,{"$f":"SUM(P$10:P780)/O780","v":0.59143968871595332},-1.7747322901338087]
[8.5023160551232664,13.480608666087123,8.5023160551232664,12.492928274749165,20.995244329872431,null,null,null,null,5,1.4094560372718901,15,21.409456037271891,null,772,1,{"$f":"SUM(P$10:P781)/O781","v":0.59196891191709844},-0.41421170739945978]
[2.6031541950757742,13.31485652545709,2.6031541950757742,14.656470681751053,17.259624876826827,null,null,null,null,5,3.2866659128120852,15,23.286665912812087,null,773,1,{"$f":"SUM(P$10:P782)/O782","v":0.59249676584734801},-6.0270410359852598]
[4.7471041135655163,10.648665252771476,4.7471041135655163,15.060552434166006,19.807656547731522,null,null,null,null,5,1.0429384729795133,15,21.042938472979515,null,774,1,{"$f":"SUM(P$10:P783)/O783","v":0.59302325581395354},-1.2352819252479925]
[8.1644584260904747,13.263480711501245,8.1644584260904747,13.307413148828775,21.471871574919248,null,null,null,null,5,2.9725675503284061,15,22.972567550328407,null,775,1,{"$f":"SUM(P$10:P784)/O784","v":0.59354838709677415},-1.5006959754091582]
[13.647162530896225,6.9887446970076805,6.9887446970076805,15.036940681218347,22.025685378226029,null,null,null,null,5,1.5431829759036981,15,21.543182975903697,null,776,0,{"$f":"SUM(P$10:P785)/O785","v":0.59278350515463918},0.4825024023223321]
[5.1281764900389737,11.448936207126003,5.1281764900389737,14.626444988101182,19.754621478140155,null,null,null,null,5,0.5029919565779839,15,20.502991956577986,null,777,1,{"$f":"SUM(P$10:P786)/O786","v":0.59330759330759331},-0.74837047843783111]
[11.606785072856155,4.5772585985499425,4.5772585985499425,15.495740264877083,20.072998863427024,null,null,null,null,5,3.4978957285208203,15,23.49789572852082,null,778,1,{"$f":"SUM(P$10:P787)/O787","v":0.59383033419023135},-3.4248968650937961]
[17.674788421682489,9.7130813730994614,9.7130813730994614,16.80367381594721,26.51675518904667,null,null,null,null,5,4.0104840100242614,15,24.01048401002426,null,779,0,{"$f":"SUM(P$10:P788)/O788","v":0.59306803594351731},2.5062711790224093]
[7.9853282013158982,9.4358908910885511,7.9853282013158982,16.520231091182232,24.50555929249813,null,null,null,null,5,3.3544999105526934,15,23.354499910552693,null,780,0,{"$f":"SUM(P$10:P789)/O789","v":0.59230769230769231},1.1510593819454371]
[{"$f":"A$7+RAND()*A$8","v":9.0355736192913305},0.12393879972065314,0.12393879972065314,13.528666058167156,13.652604857887809,null,null,null,null,5,3.3120591517245752,15,23.312059151724576,null,781,1,{"$f":"SUM(P$10:P790)/O790","v":0.59282970550576186},-9.6594542938367667]
[10.047432522795852,0.68044395720561646,0.68044395720561646,14.988701562761904,15.66914551996752,null,null,null,null,5,2.8345120090761817,15,22.834512009076182,null,782,1,{"$f":"SUM(P$10:P791)/O791","v":0.59335038363171355},-7.1653664891086617]
[10.121894282358435,7.8442548472397178E-2,7.8442548472397178E-2,14.693629288368342,14.772071836840739,null,null,null,null,5,2.4806379880054772,15,22.480637988005476,null,783,1,{"$f":"SUM(P$10:P792)/O792","v":0.5938697318007663},-7.708566151164737]
[15.45223530888139,15.909142103493037,15.45223530888139,16.94217341659774,32.394408725479131,null,null,null,null,5,2.9516219079385508,15,22.951621907938552,null,784,0,{"$f":"SUM(P$10:P793)/O793","v":0.59311224489795922},9.4427868175405791]
[18.261620358935978,11.276727413799637,11.276727413799637,13.584203577605326,24.860930991404963,null,null,null,null,5,5.5422924031485188E-2,15,20.055422924031486,null,785,0,{"$f":"SUM(P$10:P794)/O794","v":0.59235668789808915},4.8055080673734771]
[13.69077632930358,12.425837258832344,12.425837258832344,17.392419590854463,29.818256849686804,null,null,null,null,5,2.2510917859848916,15,22.25109178598489,null,786,0,{"$f":"SUM(P$10:P795)/O795","v":0.59160305343511455},7.5671650637019141]
[7.9031826624663948,16.805213883107548,7.9031826624663948,15.574361077920685,23.47754374038708,null,null,null,null,5,4.7999117286581736,15,24.799911728658174,null,787,1,{"$f":"SUM(P$10:P796)/O796","v":0.5921219822109276},-1.3223679882710933]
[2.4875027824089346,0.32506407394782499,0.32506407394782499,12.262285269454543,12.587349343402368,null,null,null,null,5,0.48001176668213852,15,20.480011766682139,null,788,1,{"$f":"SUM(P$10:P797)/O797","v":0.59263959390862941},-7.8926624232797717]
[17.922609330026429,3.5789463601383775,3.5789463601383775,17.060135542779634,20.639081902918011,null,null,null,null,5,0.90376913366471079,15,20.90376913366471,null,789,1,{"$f":"SUM(P$10:P798)/O798","v":0.59315589353612164},-0.26468723074669853]
[0.75127095457726334,11.888931183936929,0.75127095457726334,14.136762080930342,14.888033035507606,null,null,null,null,5,0.17909150738011081,15,20.179091507380111,null,790,1,{"$f":"SUM(P$10:P799)/O799","v":0.59367088607594942},-5.2910584718725051]
[5.1673813120352818,11.936200606764462,5.1673813120352818,14.312007798703197,19.479389110738481,null,null,null,null,5,4.1542972046686888,15,24.154297204668687,null,791,1,{"$f":"SUM(P$10:P800)/O800","v":0.59418457648546141},-4.6749080939302061]
[16.740525105810658,12.350528508402029,12.350528508402029,14.310896840403116,26.661425348805146,null,null,null,null,5,0.34125433059321642,15,20.341254330593216,null,792,0,{"$f":"SUM(P$10:P801)/O801","v":0.59343434343434343},6.3201710182119299]
[5.1142776627567477,8.3770516534851716,5.1142776627567477,12.826656355215679,17.940934017972427,null,null,null,null,5,2.2778376237938467,15,22.277837623793847,null,793,1,{"$f":"SUM(P$10:P802)/O802","v":0.59394703656998737},-4.3369036058214192]
[3.1260775734428181,4.19517680122794,3.1260775734428181,16.062426505240147,19.188504078682964,null,null,null,null,5,4.8483125718819196,15,24.84831257188192,null,794,1,{"$f":"SUM(P$10:P803)/O803","v":0.59445843828715361},-5.6598084931989554]
[16.607669205516938,18.721993643249967,16.607669205516938,14.563874411419462,31.1715436169364,null,null,null,null,5,1.7289907132175575,15,21.728990713217556,null,795,0,{"$f":"SUM(P$10:P804)/O804","v":0.59371069182389935},9.4425529037188447]
[19.409735968915069,14.402123776075854,14.402123776075854,13.79629027658469,28.198414052660546,null,null,null,null,5,1.6639580417946886,15,21.66395804179469,null,796,0,{"$f":"SUM(P$10:P805)/O805","v":0.59296482412060303},6.5344560108658563]
[14.493826583783703,19.50733582610852,14.493826583783703,14.968241285496809,29.46206786928051,null,null,null,null,5,0.44925133659703853,15,20.449251336597037,null,797,0,{"$f":"SUM(P$10:P806)/O806","v":0.59222082810539523},9.0128165326834733]
[14.206949801422654,18.244815177179735,14.206949801422654,17.199098685423561,31.406048486846217,null,null,null,null,5,3.1883660808135001,15,23.188366080813502,null,798,0,{"$f":"SUM(P$10:P807)/O807","v":0.5914786967418546},8.2176824060327149]
[13.624269162874075,3.136500793343111,3.136500793343111,14.286386781543209,17.422887574886321,null,null,null,null,5,1.9699868357320534,15,21.969986835732055,null,799,1,{"$f":"SUM(P$10:P808)/O808","v":0.5919899874843555},-4.5470992608457337]
[12.138803204257067,13.158705032557451,12.138803204257067,14.448186926972049,26.586990131229115,null,null,null,null,5,4.315538046891402,15,24.315538046891401,null,800,0,{"$f":"SUM(P$10:P809)/O809","v":0.59125000000000005},2.2714520843377137]
[{"$f":"A$7+RAND()*A$8","v":14.946976058146973},12.932166841939662,12.932166841939662,13.354909391136429,26.287076233076093,null,null,null,null,5,1.6076931599223299,15,21.607693159922331,null,801,0,{"$f":"SUM(P$10:P810)/O810","v":0.59051186017478152},4.6793830731537618]
[15.143811841596214,14.509394219505028,14.509394219505028,14.196836079206802,28.70623029871183,null,null,null,null,5,0.59418548517910896,15,20.594185485179111,null,802,0,{"$f":"SUM(P$10:P811)/O811","v":0.58977556109725682},8.1120448135327194]
[2.6643734259096519,16.02676279603368,2.6643734259096519,12.308901323872005,14.973274749781657,null,null,null,null,5,3.7553098296255993,15,23.755309829625599,null,803,1,{"$f":"SUM(P$10:P812)/O812","v":0.59028642590286429},-8.7820350798439417]
[17.918997994567711,0.99274257665755705,0.99274257665755705,15.978010293933325,16.970752870590882,null,null,null,null,5,1.8620117916362078,15,21.862011791636206,null,804,1,{"$f":"SUM(P$10:P813)/O813","v":0.59079601990049746},-4.8912589210453241]
[7.8371416269512473,19.064741701047961,7.8371416269512473,16.058532889139748,23.895674516090995,null,null,null,null,5,3.541172129448626,15,23.541172129448626,null,805,0,{"$f":"SUM(P$10:P814)/O814","v":0.59006211180124224},0.35450238664236977]
[0.82278945952238391,2.3709817048892501,0.82278945952238391,13.440221739670887,14.263011199193272,null,null,null,null,5,1.6810678501850167,15,21.681067850185016,null,806,1,{"$f":"SUM(P$10:P815)/O815","v":0.59057071960297769},-7.418056650991744]
[1.7250664499977031,17.952296536519889,1.7250664499977031,12.811281920061074,14.536348370058777,null,null,null,null,5,0.77986522020509097,15,20.779865220205089,null,807,1,{"$f":"SUM(P$10:P816)/O816","v":0.59107806691449816},-6.2435168501463121]
[9.1915237922091357,18.982518795217256,9.1915237922091357,12.739828372929225,21.93135216513836,null,null,null,null,5,0.81546411192788049,15,20.815464111927881,null,808,0,{"$f":"SUM(P$10:P817)/O817","v":0.59034653465346532},1.1158880532104796]
[15.60441572967938,19.515778817336372,15.60441572967938,15.752385820156169,31.356801549835549,null,null,null,null,5,3.5764427754785566,15,23.576442775478558,null,809,0,{"$f":"SUM(P$10:P818)/O818","v":0.58961681087762674},7.7803587743569906]
[17.046532062161354,12.499754095062652,12.499754095062652,13.110450538198833,25.610204633261485,null,null,null,null,5,3.4486905266297163E-2,15,20.034486905266299,null,810,0,{"$f":"SUM(P$10:P819)/O819","v":0.58888888888888891},5.5757177279951868]
[3.9501527269143644,16.000221947283698,3.9501527269143644,16.341240860149803,20.291393587064167,null,null,null,null,5,4.5184760563186508,15,24.518476056318651,null,811,1,{"$f":"SUM(P$10:P820)/O820","v":0.58939580764488286},-4.2270824692544835]
[8.0468933719666236E-2,4.3271819511529008,8.0468933719666236E-2,14.820138364204468,14.900607297924134,null,null,null,null,5,2.4089624296532208,15,22.408962429653222,null,812,1,{"$f":"SUM(P$10:P821)/O821","v":0.58990147783251234},-7.508355131729088]
[9.7663683363793865,14.273793120035309,9.7663683363793865,15.403757926543474,25.17012626292286,null,null,null,null,5,2.2449753339118712,15,22.244975333911871,null,813,0,{"$f":"SUM(P$10:P822)/O822","v":0.5891758917589176},2.9251509290109894]
[5.2203133939143287,1.5369001210305777,1.5369001210305777,17.617423579127806,19.154323700158383,null,null,null,null,5,1.8467361186948372,15,21.846736118694839,null,814,1,{"$f":"SUM(P$10:P823)/O823","v":0.58968058968058967},-2.6924124185364562]
[0.63664722152190656,18.322279935378585,0.63664722152190656,15.473207188917439,16.109854410439347,null,null,null,null,5,2.7022313269189313,15,22.70223132691893,null,815,1,{"$f":"SUM(P$10:P824)/O824","v":0.59018404907975464},-6.5923769164795836]
[4.0399446676193858,11.973502656471616,4.0399446676193858,15.469837877363961,19.509782544983345,null,null,null,null,5,2.6568926787870177,15,22.656892678787017,null,816,1,{"$f":"SUM(P$10:P825)/O825","v":0.59068627450980393},-3.1471101338036718]
[2.9245291524246553,16.674395873285601,2.9245291524246553,15.79740914777816,18.721938300202815,null,null,null,null,5,0.26084223397225492,15,20.260842233972255,null,817,1,{"$f":"SUM(P$10:P826)/O826","v":0.59118727050183595},-1.5389039337694399]
[16.319693027091525,9.9195893125170702,9.9195893125170702,15.283648757560076,25.203238070077148,null,null,null,null,5,2.3406547819945667,15,22.340654781994566,null,818,0,{"$f":"SUM(P$10:P827)/O827","v":0.59046454767726164},2.8625832880825826]
[16.975476730384592,16.015820845564718,16.015820845564718,15.041690877150341,31.057511722715059,null,null,null,null,5,0.7197331144878788,15,20.71973311448788,null,819,0,{"$f":"SUM(P$10:P828)/O828","v":0.58974358974358976},10.337778608227179]
[1.3781450829492936,9.0758968780008864,1.3781450829492936,16.490017176782342,17.868162259731633,null,null,null,null,5,2.9525913098393088,15,22.95259130983931,null,820,1,{"$f":"SUM(P$10:P829)/O829","v":0.59024390243902436},-5.0844290501076763]
[{"$f":"A$7+RAND()*A$8","v":3.7150194068333287},19.248229457261495,3.7150194068333287,16.329168775625625,20.044188182458953,null,null,null,null,5,2.3598406871552315,15,22.359840687155231,null,821,1,{"$f":"SUM(P$10:P830)/O830","v":0.59074299634591965},-2.3156525046962777]
[10.951846550894015,7.0196395441957922,7.0196395441957922,16.912150713877388,23.931790258073178,null,null,null,null,5,0.10065713864483461,15,20.100657138644834,null,822,0,{"$f":"SUM(P$10:P831)/O831","v":0.59002433090024331},3.831133119428344]
[3.0172752863919361,2.4191124079670834,2.4191124079670834,15.242511177676208,17.661623585643291,null,null,null,null,5,4.9175619225239044,15,24.917561922523905,null,823,1,{"$f":"SUM(P$10:P832)/O832","v":0.59052247873633046},-7.2559383368806145]
[5.7076472441583492,11.527351865363865,5.7076472441583492,12.811769580775984,18.519416824934332,null,null,null,null,5,1.7853290477753831,15,21.785329047775384,null,824,1,{"$f":"SUM(P$10:P833)/O833","v":0.59101941747572817},-3.2659122228410524]
[4.7501526225182662,9.1753049772298052,4.7501526225182662,14.315622188821553,19.065774811339821,null,null,null,null,5,3.3544454740373002,15,23.354445474037298,null,825,1,{"$f":"SUM(P$10:P834)/O834","v":0.59151515151515155},-4.2886706626974771]
[7.3676002572937112,1.9142632873012744,1.9142632873012744,15.215994237213817,17.130257524515091,null,null,null,null,5,4.4792285597997079,15,24.479228559799708,null,826,1,{"$f":"SUM(P$10:P835)/O835","v":0.59200968523002417},-7.3489710352846167]
[3.5165656373131648,9.0916717504608986,3.5165656373131648,14.585014378281615,18.101580015594781,null,null,null,null,5,2.5487852801077744,15,22.548785280107776,null,827,1,{"$f":"SUM(P$10:P836)/O836","v":0.592503022974607},-4.4472052645129949]
[18.032869230938651,12.697441153137646,12.697441153137646,12.18125359658646,24.878694749724104,null,null,null,null,5,2.6826097406217424,15,22.682609740621743,null,828,0,{"$f":"SUM(P$10:P837)/O837","v":0.59178743961352653},2.1960850091023616]
[10.877426928924493,18.353905842518088,10.877426928924493,16.329541041799516,27.206967970724008,null,null,null,null,5,0.60708475258844707,15,20.607084752588449,null,829,0,{"$f":"SUM(P$10:P838)/O838","v":0.59107358262967435},6.5998832181355596]
[13.812753267565919,0.28542972301336622,0.28542972301336622,12.716858854628896,13.002288577642261,null,null,null,null,5,0.24942980954249627,15,20.249429809542498,null,830,1,{"$f":"SUM(P$10:P839)/O839","v":0.59156626506024101},-7.2471412319002368]
[18.782852501692982,12.588701950769835,12.588701950769835,17.756433381308454,30.345135332078289,null,null,null,null,5,1.2184084062984231,15,21.218408406298423,null,831,0,{"$f":"SUM(P$10:P840)/O840","v":0.59085439229843562},9.1267269257798667]
[15.759583938541313,9.0599006176519588,9.0599006176519588,13.320666070603048,22.380566688255009,null,null,null,null,5,3.3746309034386917,15,23.374630903438693,null,832,1,{"$f":"SUM(P$10:P841)/O841","v":0.59134615384615385},-0.99406421518368404]
[12.492678626541071,9.0632275938746361,{"$f":"MIN(A842:B842)","v":9.0632275938746361},{"$f":"D$7+RAND()*D$8","v":12.672701375568364},{"$f":"D842+C842","v":21.735928969443002},null,null,null,null,5,{"$f":"K$7+RAND()*K$8","v":0.75755229811159008},15,{"$f":"L842+K842+J842","v":20.757552298111591},null,833,{"$f":"(E842<M842)*1","v":0},{"$f":"SUM(P$10:P842)/O842","v":0.59063625450180068},{"$f":"E842-M842","v":0.97837667133141082}]
[8.6211095008776244,5.4046396343746173,5.4046396343746173,16.049641694997231,21.454281329371849,null,null,null,null,5,1.0475531956445205,15,21.047553195644522,null,{"$f":"O842+1","v":834},0,{"$f":"SUM(P$10:P843)/O843","v":0.58992805755395683},0.40672813372732719]
[19.348540872574844,5.6305540075955811,5.6305540075955811,12.591804929326557,18.222358936922138,null,null,null,null,5,0.31228563027444367,15,20.312285630274445,null,835,1,{"$f":"SUM(P$10:P844)/O844","v":0.59041916167664665},-2.0899266933523073]
[11.759253999162706,2.9085665255838111,2.9085665255838111,13.139940322244502,16.048506847828314,null,null,null,null,5,4.2371615836864294,15,24.237161583686429,null,836,1,{"$f":"SUM(P$10:P845)/O845","v":0.59090909090909094},-8.1886547358581154]
[17.613820691549378,13.161202363465916,13.161202363465916,12.568536810756697,25.729739174222615,null,null,null,null,5,2.7965132379967321,15,22.796513237996731,null,837,0,{"$f":"SUM(P$10:P846)/O846","v":0.59020310633213857},2.9332259362258846]
[4.5611109157998548,7.9040973797228009,4.5611109157998548,13.49402051336453,18.055131429164383,null,null,null,null,5,2.5119738818776751,15,22.511973881877676,null,838,1,{"$f":"SUM(P$10:P847)/O847","v":0.59069212410501193},-4.4568424527132926]
[15.264873815800788,19.630123555179676,15.264873815800788,16.387712941207866,31.652586757008656,null,null,null,null,5,0.75470009886181022,15,20.754700098861811,null,839,0,{"$f":"SUM(P$10:P848)/O848","v":0.58998808104886769},10.897886658146845]
[15.693133458881544,5.5915359614322195,5.5915359614322195,16.026181765774389,21.61771772720661,null,null,null,null,5,2.7547656748526284,15,22.754765674852628,null,840,1,{"$f":"SUM(P$10:P849)/O849","v":0.59047619047619049},-1.1370479476460176]
[{"$f":"A$7+RAND()*A$8","v":7.1578301861517568},9.2181644532718821,7.1578301861517568,14.424200558506406,21.582030744658162,null,null,null,null,5,2.0530476899947754,15,22.053047689994777,null,841,1,{"$f":"SUM(P$10:P850)/O850","v":0.59096313912009513},-0.47101694533661487]
[1.5545376507358766,18.060867180966543,1.5545376507358766,16.741449426396443,18.29598707713232,null,null,null,null,5,4.9977223149569605,15,24.99772231495696,null,842,1,{"$f":"SUM(P$10:P851)/O851","v":0.59144893111638952},-6.7017352378246393]
[0.93298429066430488,13.91389083557884,0.93298429066430488,17.736646816117457,18.669631106781761,null,null,null,null,5,1.2822720113767627,15,21.282272011376762,null,843,1,{"$f":"SUM(P$10:P852)/O852","v":0.5919335705812574},-2.6126409045950005]
[3.5624930451869563,2.0237022144965167,2.0237022144965167,14.538810408108858,16.562512622605375,null,null,null,null,5,1.5687797263780272,15,21.568779726378025,null,844,1,{"$f":"SUM(P$10:P853)/O853","v":0.59241706161137442},-5.0062671037726503]
[19.805276506469543,5.2054940732090476,5.2054940732090476,14.47599665931782,19.681490732526868,null,null,null,null,5,0.47739862953404766,15,20.477398629534047,null,845,1,{"$f":"SUM(P$10:P854)/O854","v":0.59289940828402365},-0.79590789700717934]
[5.6484255102869207,0.63417867731138555,0.63417867731138555,13.436341704992186,14.070520382303572,null,null,null,null,5,1.7788959910687852,15,21.778895991068786,null,846,1,{"$f":"SUM(P$10:P855)/O855","v":0.59338061465721037},-7.7083756087652144]
[16.746567159716932,19.414510204911856,16.746567159716932,13.664849401975541,30.411416561692473,null,null,null,null,5,3.801681447461922,15,23.801681447461924,null,847,0,{"$f":"SUM(P$10:P856)/O856","v":0.59268004722550172},6.6097351142305492]
[2.2413212113731817,17.488854113635444,2.2413212113731817,16.51276333807877,18.754084549451953,null,null,null,null,5,0.61573951190606713,15,20.615739511906067,null,848,1,{"$f":"SUM(P$10:P857)/O857","v":0.59316037735849059},-1.8616549624541143]
[3.0199931494958632,10.074571494652194,3.0199931494958632,15.997612566065499,19.017605715561363,null,null,null,null,5,3.5329737893285684,15,23.532973789328569,null,849,1,{"$f":"SUM(P$10:P858)/O858","v":0.59363957597173145},-4.5153680737672062]
[3.2404545173565036,17.057018278239592,3.2404545173565036,16.792086247995108,20.032540765351612,null,null,null,null,5,1.5091742088135029,15,21.509174208813501,null,850,1,{"$f":"SUM(P$10:P859)/O859","v":0.59411764705882353},-1.4766334434618891]
[6.3466735623129882,19.341932631235323,6.3466735623129882,14.599879696495535,20.946553258808521,null,null,null,null,5,4.4753032985045573,15,24.475303298504556,null,851,1,{"$f":"SUM(P$10:P860)/O860","v":0.59459459459459463},-3.5287500396960354]
[4.5732301577100909,9.0750004688747428,4.5732301577100909,15.423751299205346,19.996981456915435,null,null,null,null,5,2.7725392064447707,15,22.772539206444769,null,852,1,{"$f":"SUM(P$10:P861)/O861","v":0.59507042253521125},-2.7755577495293338]
[14.521691618114225,16.396685065404775,14.521691618114225,14.415174947431213,28.936866565545436,null,null,null,null,5,2.3307385898845285,15,22.330738589884529,null,853,0,{"$f":"SUM(P$10:P862)/O862","v":0.59437280187573271},6.6061279756609075]
[1.9867543337350124,7.7498572629143236,1.9867543337350124,12.038361216717162,14.025115550452174,null,null,null,null,5,3.0440068532189555,15,23.044006853218956,null,854,1,{"$f":"SUM(P$10:P863)/O863","v":0.59484777517564402},-9.0188913027667823]
[15.157983469703948,9.5797668867179926,9.5797668867179926,17.519462211628351,27.099229098346342,null,null,null,null,5,4.9453002547292604,15,24.945300254729261,null,855,0,{"$f":"SUM(P$10:P864)/O864","v":0.59415204678362576},2.1539288436170807]
[18.358086281170252,18.354993894318177,18.354993894318177,14.493980400006564,32.848974294324741,null,null,null,null,5,2.3190982303710577,15,22.319098230371058,null,856,0,{"$f":"SUM(P$10:P865)/O865","v":0.59345794392523366},10.529876063953683]
[12.136122939887812,12.865896743547978,12.136122939887812,12.48297812907041,24.619101068958223,null,null,null,null,5,0.28583456710616073,15,20.285834567106161,null,857,0,{"$f":"SUM(P$10:P866)/O866","v":0.5927654609101517},4.3332665018520622]
[10.309701316264739,19.23798183461313,10.309701316264739,12.244507726594897,22.554209042859636,null,null,null,null,5,1.0944498576340833,15,21.094449857634082,null,858,0,{"$f":"SUM(P$10:P867)/O867","v":0.59207459207459212},1.459759185225554]
[5.010270606798648,3.9670712259260177,3.9670712259260177,17.95576464339511,21.922835869321126,null,null,null,null,5,3.0198104108092898,15,23.019810410809288,null,859,1,{"$f":"SUM(P$10:P868)/O868","v":0.59254947613504072},-1.0969745414881622]
[3.492613109714513,3.431744983366849,3.431744983366849,14.127733982843971,17.559478966210818,null,null,null,null,5,0.44792365383764077,15,20.447923653837641,null,860,1,{"$f":"SUM(P$10:P869)/O869","v":0.59302325581395354},-2.8884446876268228]
[{"$f":"A$7+RAND()*A$8","v":18.0754052244706},4.7529351053997608,4.7529351053997608,16.196085197670079,20.94902030306984,null,null,null,null,5,3.2333046496243076,15,23.233304649624309,null,861,1,{"$f":"SUM(P$10:P870)/O870","v":0.5934959349593496},-2.2842843465544682]
[11.304452985214716,7.469028780157803,7.469028780157803,15.621164214440828,23.090192994598631,null,null,null,null,5,1.8385654014410706,15,21.83856540144107,null,862,0,{"$f":"SUM(P$10:P871)/O871","v":0.59280742459396751},1.2516275931575613]
[6.1781603416764312,8.4041924514680062,6.1781603416764312,12.659853527803934,18.838013869480363,null,null,null,null,5,2.0481365184975626,15,22.048136518497564,null,863,1,{"$f":"SUM(P$10:P872)/O872","v":0.59327925840092699},-3.210122649017201]
[3.7297287031468773,8.52493108750555,3.7297287031468773,15.917952919875853,19.647681623022731,null,null,null,null,5,3.7549339413939919,15,23.754933941393993,null,864,1,{"$f":"SUM(P$10:P873)/O873","v":0.59375},-4.1072523183712626]
[5.1162553472608518,1.1457491430573152,1.1457491430573152,17.063738909450969,18.209488052508284,null,null,null,null,5,0.54460131574353254,15,20.544601315743535,null,865,1,{"$f":"SUM(P$10:P874)/O874","v":0.59421965317919079},-2.3351132632352503]
[14.009232988141155,4.2305156480054817,4.2305156480054817,13.667288997742988,17.897804645748469,null,null,null,null,5,2.6451959120974951,15,22.645195912097495,null,866,1,{"$f":"SUM(P$10:P875)/O875","v":0.59468822170900693},-4.7473912663490268]
[13.266177440624393,5.783988608668178,5.783988608668178,15.978747134766603,21.762735743434781,null,null,null,null,5,0.49688037293684539,15,20.496880372936843,null,867,0,{"$f":"SUM(P$10:P876)/O876","v":0.59400230680507493},1.2658553704979383]
[16.795573705173975,19.27900579438769,16.795573705173975,17.207021984395503,34.002595689569475,null,null,null,null,5,1.5783642112478051,15,21.578364211247806,null,868,0,{"$f":"SUM(P$10:P877)/O877","v":0.59331797235023043},12.424231478321669]
[9.3628745544710394,19.004599793145982,9.3628745544710394,16.318168367204169,25.681042921675207,null,null,null,null,5,3.6915840888659353,15,23.691584088865934,null,869,0,{"$f":"SUM(P$10:P878)/O878","v":0.59263521288837739},1.989458832809273]
[14.084022164319702,6.3640756795596971,6.3640756795596971,14.805183817295406,21.169259496855105,null,null,null,null,5,1.8928667151990757,15,21.892866715199077,null,870,1,{"$f":"SUM(P$10:P879)/O879","v":0.59310344827586203},-0.72360721834397168]
[18.24957652668153,14.838888141238558,14.838888141238558,12.251399618395643,27.090287759634201,null,null,null,null,5,4.3675307033933866,15,24.367530703393385,null,871,0,{"$f":"SUM(P$10:P880)/O880","v":0.5924225028702641},2.7227570562408161]
[18.20564597827499,14.666440426746908,14.666440426746908,15.659486812216922,30.325927238963828,null,null,null,null,5,1.5032897108763965,15,21.503289710876395,null,872,0,{"$f":"SUM(P$10:P881)/O881","v":0.59174311926605505},8.8226375280874336]
[3.6151625417202737,0.84156754486428564,0.84156754486428564,16.947210329826966,17.788777874691252,null,null,null,null,5,2.6331500774965155,15,22.633150077496516,null,873,1,{"$f":"SUM(P$10:P882)/O882","v":0.59221076746849943},-4.844372202805264]
[11.879190852531158,18.561327425226988,11.879190852531158,15.351261508686921,27.230452361218077,null,null,null,null,5,2.3527101911571258E-2,15,20.023527101911572,null,874,0,{"$f":"SUM(P$10:P883)/O883","v":0.59153318077803207},7.2069252593065052]
[7.9347010989419768,3.4096876961039158,3.4096876961039158,12.576239121420684,15.9859268175246,null,null,null,null,5,2.4334170493378626,15,22.433417049337862,null,875,1,{"$f":"SUM(P$10:P884)/O884","v":0.59199999999999997},-6.4474902318132621]
[1.964730131162431,11.961997570077056,1.964730131162431,14.461672208965911,16.426402340128341,null,null,null,null,5,3.3504780092642932,15,23.350478009264293,null,876,1,{"$f":"SUM(P$10:P885)/O885","v":0.59246575342465757},-6.9240756691359522]
[7.0485047758195618,8.7492780697226529,7.0485047758195618,17.466788213385669,24.515292989205232,null,null,null,null,5,1.5523015374118221,15,21.552301537411822,null,877,0,{"$f":"SUM(P$10:P886)/O886","v":0.59179019384264542},2.9629914517934104]
[14.398927622015435,5.9786761138854683,5.9786761138854683,13.082421344158,19.06109745804347,null,null,null,null,5,2.5681674714343834,15,22.568167471434382,null,878,1,{"$f":"SUM(P$10:P887)/O887","v":0.592255125284738},-3.5070700133909121]
[0.73040192182068919,8.2810214579810584,0.73040192182068919,14.768046556092131,15.49844847791282,null,null,null,null,5,4.5452618704886385,15,24.545261870488638,null,879,1,{"$f":"SUM(P$10:P888)/O888","v":0.59271899886234358},-9.0468133925758174]
[12.636063294436896,14.47078807065202,12.636063294436896,12.610349558725725,25.246412853162621,null,null,null,null,5,2.5954835823714699,15,22.595483582371472,null,880,0,{"$f":"SUM(P$10:P889)/O889","v":0.59204545454545454},2.6509292707911492]
[14.64808753233137,9.8390622431051593,9.8390622431051593,12.679971892682582,22.519034135787741,null,null,null,null,5,2.5989822678745602,15,22.598982267874561,null,881,1,{"$f":"SUM(P$10:P890)/O890","v":0.59250851305334851},-7.9948132086819612E-2]
[3.1327403837049372,0.37083042675651878,0.37083042675651878,17.613964599250487,17.984795026007006,null,null,null,null,5,4.6586307520792305,15,24.65863075207923,null,882,1,{"$f":"SUM(P$10:P891)/O891","v":0.59297052154195007},-6.6738357260722232]
[11.823397047250852,14.326972397891776,11.823397047250852,13.66044997862465,25.483847025875502,null,null,null,null,5,0.77645491581851134,15,20.776454915818512,null,883,0,{"$f":"SUM(P$10:P892)/O892","v":0.59229898074745191},4.7073921100569898]
[15.390136335637393,8.9936417439046288,8.9936417439046288,15.324119409183622,24.317761153088249,null,null,null,null,5,1.3885592850822925,15,21.388559285082291,null,884,0,{"$f":"SUM(P$10:P893)/O893","v":0.59162895927601811},2.9292018680059577]
[0.45719178987789988,8.0103617207371709,0.45719178987789988,14.333500259093917,14.790692048971817,null,null,null,null,5,2.5920386133333713,15,22.592038613333372,null,885,1,{"$f":"SUM(P$10:P894)/O894","v":0.59209039548022602},-7.8013465643615554]